{"text_format":"1","workbook":"xlsx","n_sheets":7,"sheets":["Forsíða","Keppendur","Úrslit","Viðmið","Met25","Met50","Verðlaun"],"not_rendered":{"charts":0,"images":0,"macros":1,"external_links":0,"defined_names":0,"comments":0,"pivot_tables":0},"unopened":[],"bounds":{"document_bytes":16777216,"sheet_cells":100000,"rows_first":2000,"rows_last":500,"rows_between":2000,"halvings":0,"cell_chars":16384,"cell_head_chars":4096},"cells_cut":0,"cells_raw":0,"read":"whole","date_system":"1900"}

{"sheet":"Forsíða","index":0,"n_rows":5,"n_cols":4,"rows_kept":5,"cut":false,"hidden":false,"merged":[]}
[]
["Mót:",null,null,"Meistaramót"]
[null,null,null,"E:\\Nýársmót2016.mdb"]
["Braut:",null,null,"25m"]
["Raðir per grein:",null,null,70]

{"sheet":"Keppendur","index":1,"n_rows":89,"n_cols":10,"rows_kept":89,"cut":false,"hidden":false,"merged":[]}
[]
[]
[]
[]
[null,"Númer","Nafn","Aldur","Lið","S","SB","SM"]
[null,23,"Baldur E Traustason",11,"ÍFR                           ",14,14,14,null,"Baldur E Traustason S14"]
[null,27,"Bergdís Ó Vilhjálmsdótt",11,"ÍFR                           ",7,6,7,null,"Bergdís Ó Vilhjálmsdótt S7 Sb6"]
[null,15,"Björn  Axel Agnarsson",13,"ÍFR                           ",20,20,20,null,"Björn  Axel Agnarsson S20"]
[null,25,"Elís F Stephen",10,"ÍFR                           ",null,null,null,null,"Elís F Stephen"]
[null,16,"Haukur H Loftsson",15,"ÍFR                           ",4,4,4,null,"Haukur H Loftsson S4"]
[null,26,"Heiður B Egilsdóttir",11,"ÍFR                           ",8,8,8,null,"Heiður B Egilsdóttir S8"]
[null,24,"Hilmar L Davíðsson",10,"ÍFR                           ",10,9,10,null,"Hilmar L Davíðsson S10 SB9"]
[null,22,"Hlynur B Steingrímsson",12,"ÍFR                           ",null,null,null,null,"Hlynur B Steingrímsson"]
[null,19,"Ingi B Torsteinsson",11,"ÍFR                           ",null,null,null,null,"Ingi B Torsteinsson"]
[null,17,"Ólafur Helgason",14,"ÍFR                           ",9,8,9,null,"Ólafur Helgason S9 SB8"]
[null,29,"Ólafur F Jónasson",14,"ÍFR                           ",14,14,14,null,"Ólafur F Jónasson S14"]
[null,18,"Reynir A Magnússon",14,"ÍFR                           ",14,14,14,null,"Reynir A Magnússon S14"]
[null,28,"Snævar Örn Kristmannsson",9,"ÍFR                           ",14,14,14,null,"Snævar Örn Kristmannsson S14"]
[null,20,"Thórey Í Magnúsdóttir",16,"ÍFR                           ",14,14,14,null,"Thórey Í Magnúsdóttir S14"]
[null,21,"Torbjörn Helgason",12,"ÍFR                           ",null,null,null,null,"Torbjörn Helgason"]
[null,53,"Ágústa H Snorradóttir",0,"Íþróttafélagið Fjörður        ",14,14,14,null,"Ágústa H Snorradóttir S14"]
[null,56,"Aníta R Elíasdóttir",0,"Íþróttafélagið Fjörður        ",14,14,14,null,"Aníta R Elíasdóttir S14"]
[null,5,"Anna R Þrastardóttir",10,"Íþróttafélagið Fjörður        ",14,14,14,null,"Anna R Þrastardóttir S14"]
[null,9,"Baldur M Kristinsson",10,"Íþróttafélagið Fjörður        ",14,14,14,null,"Baldur M Kristinsson S14"]
[null,49,"Birnir S Jökulsson",0,"Íþróttafélagið Fjörður        ",14,14,14,null,"Birnir S Jökulsson S14"]
[null,48,"Brynjar I ",0,"Íþróttafélagið Fjörður        ",14,14,14,null,"Brynjar I S14"]
[null,47,"Elsa R Sigmundsdóttir",0,"Íþróttafélagið Fjörður        ",14,14,14,null,"Elsa R Sigmundsdóttir S14"]
[null,13,"Emelía Ý Gunnarsdóttir",9,"Íþróttafélagið Fjörður        ",14,14,14,null,"Emelía Ý Gunnarsdóttir S14"]
[null,14,"Guðbjörg S Sigfúsdóttir",15,"Íþróttafélagið Fjörður        ",14,14,14,null,"Guðbjörg S Sigfúsdóttir S14"]
[null,4,"Guðmundur A Sigurðsson",10,"Íþróttafélagið Fjörður        ",10,10,10,null,"Guðmundur A Sigurðsson S10"]
[null,51,"Gustas E Poskus",0,"Íþróttafélagið Fjörður        ",14,14,14,null,"Gustas E Poskus S14"]
[null,1,"Hallgrímur A Heimisson",14,"Íþróttafélagið Fjörður        ",14,14,14,null,"Hallgrímur A Heimisson  S14"]
[null,54,"Hólmar I Kristinsson",0,"Íþróttafélagið Fjörður        ",14,14,14,null,"Hólmar I Kristinsson S14"]
[null,8,"Katrín E Kristjánsdóttir",11,"Íþróttafélagið Fjörður        ",14,14,14,null,"Katrín E Kristjánsdóttir S14"]
[null,10,"Kristjana L Albertsdóttir",0,"Íþróttafélagið Fjörður        ",14,14,14,null,"Kristjana L Albertsdóttir S14"]
[null,50,"Lea K Friðbjörnsdóttir",0,"Íþróttafélagið Fjörður        ",14,14,14,null,"Lea K Friðbjörnsdóttir S14"]
[null,6,"Nevena Cupovic",15,"Íþróttafélagið Fjörður        ",14,14,14,null,"Nevena Cupovic S14"]
[null,3,"Róbert Í Jónsson",14,"Íþróttafélagið Fjörður        ",14,14,14,null,"Róbert Í Jónsson  S14"]
[null,55,"Sara A Elíasdóttir",0,"Íþróttafélagið Fjörður        ",14,14,14,null,"Sara A Elíasdóttir S14"]
[null,7,"Sigríður Aníta Rögnvaldsóttir",13,"Íþróttafélagið Fjörður        ",14,14,14,null,"Sigríður Aníta Rögnvaldsóttir S14"]
[null,12,"Sigrún Kjartansdóttir",0,"Íþróttafélagið Fjörður        ",14,14,14,null,"Sigrún Kjartansdóttir S14"]
[null,52,"Steinunn E Sigurðardóttir",0,"Íþróttafélagið Fjörður        ",14,14,14,null,"Steinunn E Sigurðardóttir S14"]
[null,2,"Unnar I Ingason",14,"Íþróttafélagið Fjörður        ",14,14,14,null,"Unnar I Ingason S14"]
[null,11,"Victoria L Karenardóttir",0,"Íþróttafélagið Fjörður        ",14,14,14,null,"Victoria L Karenardóttir S14"]
[null,83,"Ævar Kristjánsson",11,"Íþróttafélagið Ösp            ",14,14,14,null,"Ævar Kristjánsson S14"]
[null,73,"Ágúst S Sigmarsson",6,"Íþróttafélagið Ösp            ",14,14,14,null,"Ágúst S Sigmarsson S14"]
[null,82,"Bjarki H Erlingsson",9,"Íþróttafélagið Ösp            ",14,14,14,null,"Bjarki H Erlingsson S14"]
[null,74,"Breki Björnsson",11,"Íþróttafélagið Ösp            ",14,14,14,null,"Breki Björnsson S14"]
[null,79,"Bríana O Hjálmarsdóttir",11,"Íþróttafélagið Ösp            ",14,14,14,null,"Bríana O Hjálmarsdóttir S14"]
[null,77,"Dagmar Hákonardóttir",12,"Íþróttafélagið Ösp            ",14,14,14,null,"Dagmar Hákonardóttir S14"]
[null,72,"Daníel S Hafþórsson",12,"Íþróttafélagið Ösp            ",14,14,14,null,"Daníel S Hafþórsson S14"]
[null,71,"Gísli K Árnason",10,"Íþróttafélagið Ösp            ",14,14,14,null,"Gísli K Árnason S14"]
[null,81,"Gunnhildur M Baldursdóttir",7,"Íþróttafélagið Ösp            ",14,14,14,null,"Gunnhildur M Baldursdóttir S14"]
[null,32,"Gunnhildur Brynja Be",14,"Íþróttafélagið Ösp            ",14,14,14,null,"Gunnhildur Brynja Be s14"]
[null,69,"Hjalti G Guðmundsson",0,"Íþróttafélagið Ösp            ",14,14,14,null,"Hjalti G Guðmundsson S14"]
[null,30,"Jóhann Stígur Eiríksson",15,"Íþróttafélagið Ösp            ",14,14,14,null,"Jóhann Stígur Eiríksson s14"]
[null,31,"Magnús Aron Ceesay Aron Ceesay",14,"Íþróttafélagið Ösp            ",14,14,14,null,"Magnús Aron Ceesay Aron Ceesay s14"]
[null,75,"Ólafur Jónsson",11,"Íþróttafélagið Ösp            ",14,14,14,null,"Ólafur Jónsson S14"]
[null,70,"Pétur M Helgason",12,"Íþróttafélagið Ösp            ",14,14,14,null,"Pétur M Helgason S14"]
[null,76,"Sigrún B Pálsdóttir",13,"Íþróttafélagið Ösp            ",14,14,14,null,"Sigrún B Pálsdóttir S14"]
[null,33,"Þorleifur Pálmi Páls",12,"Íþróttafélagið Ösp            ",14,14,14,null,"Þorleifur Pálmi Páls s14"]
[null,78,"Þráinn Ásbjarnarson",13,"Íþróttafélagið Ösp            ",14,14,14,null,"Þráinn Ásbjarnarson S14"]
[null,80,"Védís K Vilhjálmsdóttir",12,"Íþróttafélagið Ösp            ",14,14,14,null,"Védís K Vilhjálmsdóttir S14"]
[null,39,"Alexander Guðmundsson",12,"NES                           ",14,14,14,null,"Alexander Guðmundsson S14"]
[null,34,"Andri F Ágústsson",11,"NES                           ",18,18,18,null,"Andri F Ágústsson S18"]
[null,46,"Ástmar Steingrímsson",7,"NES                           ",14,14,14,null,"Ástmar Steingrímsson S14"]
[null,36,"Ástrós M Bjarnadóttir",16,"NES                           ",18,18,18,null,"Ástrós M Bjarnadóttir S18"]
[null,84,"Birta Bjarnadóttir",12,"NES                           ",14,14,14,null,"Birta Bjarnadóttir"]
[null,44,"Guðrún Aðalbergsdóttir",4,"NES                           ",14,14,14,null,"Guðrún Aðalbergsdóttir S14"]
[null,41,"Ingibjörg F Margeirsdóttir",16,"NES                           ",14,14,14,null,"Ingibjörg F Margeirsdóttir S14"]
[null,37,"Ingólfur M Bjarnason",15,"NES                           ",10,10,10,null,"Ingólfur M Bjarnason S10"]
[null,35,"Leó Baldurrson",10,"NES                           ",14,14,14,null,"Leó Baldurrson S14"]
[null,40,"Már Gunnarsson",16,"NES                           ",12,12,12,null,"Már Gunnarsson S12"]
[null,43,"Matthildur E Sigurðardóttir",10,"NES                           ",10,10,10,null,"Matthildur E Sigurðardóttir S10"]
[null,38,"Óskar F Björnsson",10,"NES                           ",14,14,14,null,"Óskar F Björnsson S14"]
[null,42,"Róbert Salvar Reynisson",16,"NES                           ",9,9,9,null,"Róbert Salvar Reynisson S9"]
[null,45,"Þórunn L Sigurðardóttir",8,"NES                           ",8,8,8,null,"Þórunn L Sigurðardóttir S8"]
[null,66,"Ævar O Einarsson",11,"Suðri",14,14,14,null,"Ævar O Einarsson S14"]
[null,63,"Katla S Ægisdóttir",15,"Suðri",14,14,14,null,"Katla S Ægisdóttir S14"]
[null,64,"Matthías M Elíasson",10,"Suðri",14,14,14,null,"Matthías M Elíasson S14"]
[null,65,"Skúli Bárðarson",11,"Suðri",14,14,14,null,"Skúli Bárðarson S14"]
[null,67,"Sandra S Gunnarsdóttir",16,"Sunddeild Fjölnis             ",12,12,12,null,"Sandra S Gunnarsdóttir S-12"]
[null,68,"Sigurður I Sigurðsson",11,"Sunddeild Fjölnis             ",10,10,10,null,"Sigurður I Sigurðsson S10"]
[null,57,"Arndís Atladóttir",15,"Sundfélagið Óðinn             ",14,14,14,null,"Arndís Atladóttir S14"]
[null,58,"Fannar Logi Jóhannesson",15,"Sundfélagið Óðinn             ",14,14,14,null,"Fannar Logi Jóhannesson"]
[null,60,"Íris Anna Jóhannesdóttir",6,"Sundfélagið Óðinn             ",null,null,null,null,"Íris Anna Jóhannesdóttir"]
[null,61,"Kristín Erna Jakopsdóttir",10,"Sundfélagið Óðinn             ",null,null,null,null,"Kristín Erna Jakopsdóttir"]
[null,62,"Logi Ingólfsson",9,"Sundfélagið Óðinn             ",20,20,20,null,"Logi Ingólfsson"]
[null,59,"Tinna Rut Andrésdóttir",16,"Sundfélagið Óðinn             ",14,14,14,null,"Tinna Rut Andrésdóttir S14"]

{"sheet":"Úrslit","index":2,"n_rows":1430,"n_cols":13,"rows_kept":1430,"cut":false,"hidden":false,"merged":[]}
[]
[]
[]
[]
[]
[]
[null,"1. Grein: Drengir 50m Baksund"]
[]
[null,0,{"$f":"VLOOKUP(42,Keppendur!B6:C1000,2,FALSE)","v":"Róbert Salvar Reynisson"},{"$f":"VLOOKUP(42,Keppendur!B6:D1000,3,FALSE)","v":16},{"$f":"VLOOKUP(42,Keppendur!B6:E1000,4,FALSE)","v":"NES                           "},{"$f":"CONCATENATE(\"S\",INDEX(Keppendur!F6:H1000,MATCH(42,Keppendur!B6:B1000,0),MATCH(\"S\",Keppendur!F5:H5,0)))","v":"S9"},"00:00:52",{"$f":"INDEX(Viðmið!$B$23:$T$39,MATCH(F9,Viðmið!$A$23:$A$39, 0),MATCH(\"50 bak\",Viðmið!$B$22:$T$22,0))","v":"00:00:28.877"}]
[null,"Riðill #1",null,"Aldur",null,null,"Besti tími","Viðmið","Loka Tími","Stig","Met"]
[null,3,{"$f":"VLOOKUP(35,Keppendur!B6:C1000,2,FALSE)","v":"Leó Baldurrson"},{"$f":"VLOOKUP(35,Keppendur!B6:D1000,3,FALSE)","v":10},{"$f":"VLOOKUP(35,Keppendur!B6:E1000,4,FALSE)","v":"NES                           "},{"$f":"CONCATENATE(\"S\",INDEX(Keppendur!F6:H1000,MATCH(35,Keppendur!B6:B1000,0),MATCH(\"S\",Keppendur!F5:H5,0)))","v":"S14"},"00:00:00",{"$f":"INDEX(Viðmið!$B$23:$T$39,MATCH(F11,Viðmið!$A$23:$A$39, 0),MATCH(\"50 bak\",Viðmið!$B$22:$T$22,0))","v":"00:00:27.428"},"00:01:20.820",{"$f":"POWER((10*H:H/I:I),3)","v":39.086425654984069},{"$f":"IF(I11 < INDEX('Met25'!$B$23:$T$39,MATCH(F11,'Met25'!$A$23:$A$39, 0),MATCH(\"50 bak\",'Met25'!$B$22:$T$22,0)), \"X\", \"\")","v":""}]
[null,5,{"$f":"VLOOKUP(62,Keppendur!B6:C1000,2,FALSE)","v":"Logi Ingólfsson"},{"$f":"VLOOKUP(62,Keppendur!B6:D1000,3,FALSE)","v":9},{"$f":"VLOOKUP(62,Keppendur!B6:E1000,4,FALSE)","v":"Sundfélagið Óðinn             "},{"$f":"CONCATENATE(\"S\",INDEX(Keppendur!F6:H1000,MATCH(62,Keppendur!B6:B1000,0),MATCH(\"S\",Keppendur!F5:H5,0)))","v":"S20"},"00:00:00",{"$f":"INDEX(Viðmið!$B$23:$T$39,MATCH(F12,Viðmið!$A$23:$A$39, 0),MATCH(\"50 bak\",Viðmið!$B$22:$T$22,0))","v":"00:00:24.040"},"DQ"]
[null,6,{"$f":"VLOOKUP(69,Keppendur!B6:C1000,2,FALSE)","v":"Hjalti G Guðmundsson"},{"$f":"VLOOKUP(69,Keppendur!B6:D1000,3,FALSE)","v":0},{"$f":"VLOOKUP(69,Keppendur!B6:E1000,4,FALSE)","v":"Íþróttafélagið Ösp            "},{"$f":"CONCATENATE(\"S\",INDEX(Keppendur!F6:H1000,MATCH(69,Keppendur!B6:B1000,0),MATCH(\"S\",Keppendur!F5:H5,0)))","v":"S14"},"NT",{"$f":"INDEX(Viðmið!$B$23:$T$39,MATCH(F13,Viðmið!$A$23:$A$39, 0),MATCH(\"50 bak\",Viðmið!$B$22:$T$22,0))","v":"00:00:27.428"},"00:01:06.760",{"$f":"POWER((10*H:H/I:I),3)","v":69.347931498846634},{"$f":"IF(I13 < INDEX('Met25'!$B$23:$T$39,MATCH(F13,'Met25'!$A$23:$A$39, 0),MATCH(\"50 bak\",'Met25'!$B$22:$T$22,0)), \"X\", \"\")","v":""}]
[null,"Riðill #2",null,"Aldur",null,null,"Besti tími","Viðmið","Loka Tími","Stig","Met"]
[null,3,{"$f":"VLOOKUP(9,Keppendur!B6:C1000,2,FALSE)","v":"Baldur M Kristinsson"},{"$f":"VLOOKUP(9,Keppendur!B6:D1000,3,FALSE)","v":10},{"$f":"VLOOKUP(9,Keppendur!B6:E1000,4,FALSE)","v":"Íþróttafélagið Fjörður        "},{"$f":"CONCATENATE(\"S\",INDEX(Keppendur!F6:H1000,MATCH(9,Keppendur!B6:B1000,0),MATCH(\"S\",Keppendur!F5:H5,0)))","v":"S14"},"00:01:21.600",{"$f":"INDEX(Viðmið!$B$23:$T$39,MATCH(F15,Viðmið!$A$23:$A$39, 0),MATCH(\"50 bak\",Viðmið!$B$22:$T$22,0))","v":"00:00:27.428"},"00:01:01.890",{"$f":"POWER((10*H:H/I:I),3)","v":87.040433926308111},{"$f":"IF(I15 < INDEX('Met25'!$B$23:$T$39,MATCH(F15,'Met25'!$A$23:$A$39, 0),MATCH(\"50 bak\",'Met25'!$B$22:$T$22,0)), \"X\", \"\")","v":""}]
[null,4,{"$f":"VLOOKUP(2,Keppendur!B6:C1000,2,FALSE)","v":"Unnar I Ingason"},{"$f":"VLOOKUP(2,Keppendur!B6:D1000,3,FALSE)","v":14},{"$f":"VLOOKUP(2,Keppendur!B6:E1000,4,FALSE)","v":"Íþróttafélagið Fjörður        "},{"$f":"CONCATENATE(\"S\",INDEX(Keppendur!F6:H1000,MATCH(2,Keppendur!B6:B1000,0),MATCH(\"S\",Keppendur!F5:H5,0)))","v":"S14"},"00:01:03.390",{"$f":"INDEX(Viðmið!$B$23:$T$39,MATCH(F16,Viðmið!$A$23:$A$39, 0),MATCH(\"50 bak\",Viðmið!$B$22:$T$22,0))","v":"00:00:27.428"},"DQ"]
[null,5,{"$f":"VLOOKUP(28,Keppendur!B6:C1000,2,FALSE)","v":"Snævar Örn Kristmannsson"},{"$f":"VLOOKUP(28,Keppendur!B6:D1000,3,FALSE)","v":9},{"$f":"VLOOKUP(28,Keppendur!B6:E1000,4,FALSE)","v":"ÍFR                           "},{"$f":"CONCATENATE(\"S\",INDEX(Keppendur!F6:H1000,MATCH(28,Keppendur!B6:B1000,0),MATCH(\"S\",Keppendur!F5:H5,0)))","v":"S14"},"00:01:11.080",{"$f":"INDEX(Viðmið!$B$23:$T$39,MATCH(F17,Viðmið!$A$23:$A$39, 0),MATCH(\"50 bak\",Viðmið!$B$22:$T$22,0))","v":"00:00:27.428"},"00:01:00.080",{"$f":"POWER((10*H:H/I:I),3)","v":95.1464794776237},{"$f":"IF(I17 < INDEX('Met25'!$B$23:$T$39,MATCH(F17,'Met25'!$A$23:$A$39, 0),MATCH(\"50 bak\",'Met25'!$B$22:$T$22,0)), \"X\", \"\")","v":""}]
[null,6,{"$f":"VLOOKUP(33,Keppendur!B6:C1000,2,FALSE)","v":"Þorleifur Pálmi Páls"},{"$f":"VLOOKUP(33,Keppendur!B6:D1000,3,FALSE)","v":12},{"$f":"VLOOKUP(33,Keppendur!B6:E1000,4,FALSE)","v":"Íþróttafélagið Ösp            "},{"$f":"CONCATENATE(\"S\",INDEX(Keppendur!F6:H1000,MATCH(33,Keppendur!B6:B1000,0),MATCH(\"S\",Keppendur!F5:H5,0)))","v":"S14"},"00:01:24.660",{"$f":"INDEX(Viðmið!$B$23:$T$39,MATCH(F18,Viðmið!$A$23:$A$39, 0),MATCH(\"50 bak\",Viðmið!$B$22:$T$22,0))","v":"00:00:27.428"},"00:01:37.990",{"$f":"POWER((10*H:H/I:I),3)","v":21.929928844779305},{"$f":"IF(I18 < INDEX('Met25'!$B$23:$T$39,MATCH(F18,'Met25'!$A$23:$A$39, 0),MATCH(\"50 bak\",'Met25'!$B$22:$T$22,0)), \"X\", \"\")","v":""}]
[null,7,{"$f":"VLOOKUP(30,Keppendur!B6:C1000,2,FALSE)","v":"Jóhann Stígur Eiríksson"},{"$f":"VLOOKUP(30,Keppendur!B6:D1000,3,FALSE)","v":15},{"$f":"VLOOKUP(30,Keppendur!B6:E1000,4,FALSE)","v":"Íþróttafélagið Ösp            "},{"$f":"CONCATENATE(\"S\",INDEX(Keppendur!F6:H1000,MATCH(30,Keppendur!B6:B1000,0),MATCH(\"S\",Keppendur!F5:H5,0)))","v":"S14"},"00:01:29.560",{"$f":"INDEX(Viðmið!$B$23:$T$39,MATCH(F19,Viðmið!$A$23:$A$39, 0),MATCH(\"50 bak\",Viðmið!$B$22:$T$22,0))","v":"00:00:27.428"},"00:01:22.040",{"$f":"POWER((10*H:H/I:I),3)","v":37.368489258811962},{"$f":"IF(I19 < INDEX('Met25'!$B$23:$T$39,MATCH(F19,'Met25'!$A$23:$A$39, 0),MATCH(\"50 bak\",'Met25'!$B$22:$T$22,0)), \"X\", \"\")","v":""}]
[null,"Riðill #3",null,"Aldur",null,null,"Besti tími","Viðmið","Loka Tími","Stig","Met"]
[null,2,{"$f":"VLOOKUP(58,Keppendur!B6:C1000,2,FALSE)","v":"Fannar Logi Jóhannesson"},{"$f":"VLOOKUP(58,Keppendur!B6:D1000,3,FALSE)","v":15},{"$f":"VLOOKUP(58,Keppendur!B6:E1000,4,FALSE)","v":"Sundfélagið Óðinn             "},"S14","00:00:46.550",{"$f":"INDEX(Viðmið!$B$23:$T$39,MATCH(F21,Viðmið!$A$23:$A$39, 0),MATCH(\"50 bak\",Viðmið!$B$22:$T$22,0))","v":"00:00:27.428"},"00:00:44.170",{"$f":"POWER((10*H:H/I:I),3)","v":239.44198145701108},{"$f":"IF(I21 < INDEX('Met25'!$B$23:$T$39,MATCH(F21,'Met25'!$A$23:$A$39, 0),MATCH(\"50 bak\",'Met25'!$B$22:$T$22,0)), \"X\", \"\")","v":""}]
[null,3,{"$f":"VLOOKUP(15,Keppendur!B6:C1000,2,FALSE)","v":"Björn  Axel Agnarsson"},{"$f":"VLOOKUP(15,Keppendur!B6:D1000,3,FALSE)","v":13},{"$f":"VLOOKUP(15,Keppendur!B6:E1000,4,FALSE)","v":"ÍFR                           "},{"$f":"CONCATENATE(\"S\",INDEX(Keppendur!F6:H1000,MATCH(15,Keppendur!B6:B1000,0),MATCH(\"S\",Keppendur!F5:H5,0)))","v":"S20"},"00:00:39.020",{"$f":"INDEX(Viðmið!$B$23:$T$39,MATCH(F22,Viðmið!$A$23:$A$39, 0),MATCH(\"50 bak\",Viðmið!$B$22:$T$22,0))","v":"00:00:24.040"},"00:00:34.160",{"$f":"POWER((10*H:H/I:I),3)","v":348.53773449372221},{"$f":"IF(I22 < INDEX('Met25'!$B$23:$T$39,MATCH(F22,'Met25'!$A$23:$A$39, 0),MATCH(\"50 bak\",'Met25'!$B$22:$T$22,0)), \"X\", \"\")","v":""}]
[null,4,{"$f":"VLOOKUP(3,Keppendur!B6:C1000,2,FALSE)","v":"Róbert Í Jónsson"},{"$f":"VLOOKUP(3,Keppendur!B6:D1000,3,FALSE)","v":14},{"$f":"VLOOKUP(3,Keppendur!B6:E1000,4,FALSE)","v":"Íþróttafélagið Fjörður        "},{"$f":"CONCATENATE(\"S\",INDEX(Keppendur!F6:H1000,MATCH(3,Keppendur!B6:B1000,0),MATCH(\"S\",Keppendur!F5:H5,0)))","v":"S14"},"00:00:36.540",{"$f":"INDEX(Viðmið!$B$23:$T$39,MATCH(F23,Viðmið!$A$23:$A$39, 0),MATCH(\"50 bak\",Viðmið!$B$22:$T$22,0))","v":"00:00:27.428"},"00:00:33.060",{"$f":"POWER((10*H:H/I:I),3)","v":571.04975275844936},{"$f":"IF(I23 < INDEX('Met25'!$B$23:$T$39,MATCH(F23,'Met25'!$A$23:$A$39, 0),MATCH(\"50 bak\",'Met25'!$B$22:$T$22,0)), \"X\", \"\")","v":""}]
[null,5,{"$f":"VLOOKUP(40,Keppendur!B6:C1000,2,FALSE)","v":"Már Gunnarsson"},{"$f":"VLOOKUP(40,Keppendur!B6:D1000,3,FALSE)","v":16},{"$f":"VLOOKUP(40,Keppendur!B6:E1000,4,FALSE)","v":"NES                           "},{"$f":"CONCATENATE(\"S\",INDEX(Keppendur!F6:H1000,MATCH(40,Keppendur!B6:B1000,0),MATCH(\"S\",Keppendur!F5:H5,0)))","v":"S12"},"00:00:37",{"$f":"INDEX(Viðmið!$B$23:$T$39,MATCH(F24,Viðmið!$A$23:$A$39, 0),MATCH(\"50 bak\",Viðmið!$B$22:$T$22,0))","v":"00:00:27.470"},"00:00:36.780",{"$f":"POWER((10*H:H/I:I),3)","v":416.60506842433557},{"$f":"IF(I24 < INDEX('Met25'!$B$23:$T$39,MATCH(F24,'Met25'!$A$23:$A$39, 0),MATCH(\"50 bak\",'Met25'!$B$22:$T$22,0)), \"X\", \"\")","v":""}]
[null,6,{"$f":"VLOOKUP(37,Keppendur!B6:C1000,2,FALSE)","v":"Ingólfur M Bjarnason"},{"$f":"VLOOKUP(37,Keppendur!B6:D1000,3,FALSE)","v":15},{"$f":"VLOOKUP(37,Keppendur!B6:E1000,4,FALSE)","v":"NES                           "},{"$f":"CONCATENATE(\"S\",INDEX(Keppendur!F6:H1000,MATCH(37,Keppendur!B6:B1000,0),MATCH(\"S\",Keppendur!F5:H5,0)))","v":"S10"},"00:00:46",{"$f":"INDEX(Viðmið!$B$23:$T$39,MATCH(F25,Viðmið!$A$23:$A$39, 0),MATCH(\"50 bak\",Viðmið!$B$22:$T$22,0))","v":"00:00:27.567"},"00:00:58.450",{"$f":"POWER((10*H:H/I:I),3)","v":104.90787131682642},{"$f":"IF(I25 < INDEX('Met25'!$B$23:$T$39,MATCH(F25,'Met25'!$A$23:$A$39, 0),MATCH(\"50 bak\",'Met25'!$B$22:$T$22,0)), \"X\", \"\")","v":""}]
[null,7,{"$f":"VLOOKUP(39,Keppendur!B6:C1000,2,FALSE)","v":"Alexander Guðmundsson"},{"$f":"VLOOKUP(39,Keppendur!B6:D1000,3,FALSE)","v":12},{"$f":"VLOOKUP(39,Keppendur!B6:E1000,4,FALSE)","v":"NES                           "},{"$f":"CONCATENATE(\"S\",INDEX(Keppendur!F6:H1000,MATCH(39,Keppendur!B6:B1000,0),MATCH(\"S\",Keppendur!F5:H5,0)))","v":"S14"},"00:00:48",{"$f":"INDEX(Viðmið!$B$23:$T$39,MATCH(F26,Viðmið!$A$23:$A$39, 0),MATCH(\"50 bak\",Viðmið!$B$22:$T$22,0))","v":"00:00:27.428"},"DQ"]
[null,8,{"$f":"VLOOKUP(1,Keppendur!B6:C1000,2,FALSE)","v":"Hallgrímur A Heimisson"},{"$f":"VLOOKUP(1,Keppendur!B6:D1000,3,FALSE)","v":14},{"$f":"VLOOKUP(1,Keppendur!B6:E1000,4,FALSE)","v":"Íþróttafélagið Fjörður        "},{"$f":"CONCATENATE(\"S\",INDEX(Keppendur!F6:H1000,MATCH(1,Keppendur!B6:B1000,0),MATCH(\"S\",Keppendur!F5:H5,0)))","v":"S14"},"00:01:00.910",{"$f":"INDEX(Viðmið!$B$23:$T$39,MATCH(F27,Viðmið!$A$23:$A$39, 0),MATCH(\"50 bak\",Viðmið!$B$22:$T$22,0))","v":"00:00:27.428"}]
[]
[]
[]
[]
[]
[]
[]
[]
[]
[]
[]
[]
[]
[]
[]
[]
[]
[]
[]
[]
[]
[]
[]
[]
[]
[]
[]
[]
[]
[]
[]
[]
[]
[]
[]
[]
[]
[]
[]
[]
[]
[]
[]
[]
[]
[]
[]
[]
[]
[null,"2. Grein: Stúlkur 50m Baksund"]
[]
[null,0,{"$f":"VLOOKUP(41,Keppendur!B6:C1000,2,FALSE)","v":"Ingibjörg F Margeirsdóttir"},{"$f":"VLOOKUP(41,Keppendur!B6:D1000,3,FALSE)","v":16},{"$f":"VLOOKUP(41,Keppendur!B6:E1000,4,FALSE)","v":"NES                           "},{"$f":"CONCATENATE(\"S\",INDEX(Keppendur!F6:H1000,MATCH(41,Keppendur!B6:B1000,0),MATCH(\"S\",Keppendur!F5:H5,0)))","v":"S14"},"00:00:44",{"$f":"INDEX(Viðmið!$B$3:$T$19,MATCH(F79,Viðmið!$A$3:$A$19, 0),MATCH(\"50 bak\",Viðmið!$B$2:$T$2,0))","v":"00:00:30.124"}]
[null,"Riðill #1",null,"Aldur",null,null,"Besti tími","Viðmið","Loka Tími","Stig","Met"]
[null,4,{"$f":"VLOOKUP(13,Keppendur!B6:C1000,2,FALSE)","v":"Emelía Ý Gunnarsdóttir"},{"$f":"VLOOKUP(13,Keppendur!B6:D1000,3,FALSE)","v":9},{"$f":"VLOOKUP(13,Keppendur!B6:E1000,4,FALSE)","v":"Íþróttafélagið Fjörður        "},{"$f":"CONCATENATE(\"S\",INDEX(Keppendur!F6:H1000,MATCH(13,Keppendur!B6:B1000,0),MATCH(\"S\",Keppendur!F5:H5,0)))","v":"S14"},"00:02:02.700",{"$f":"INDEX(Viðmið!$B$3:$T$19,MATCH(F81,Viðmið!$A$3:$A$19, 0),MATCH(\"50 bak\",Viðmið!$B$2:$T$2,0))","v":"00:00:30.124"},"DQ"]
[null,5,{"$f":"VLOOKUP(10,Keppendur!B6:C1000,2,FALSE)","v":"Kristjana L Albertsdóttir"},{"$f":"VLOOKUP(10,Keppendur!B6:D1000,3,FALSE)","v":0},{"$f":"VLOOKUP(10,Keppendur!B6:E1000,4,FALSE)","v":"Íþróttafélagið Fjörður        "},{"$f":"CONCATENATE(\"S\",INDEX(Keppendur!F6:H1000,MATCH(10,Keppendur!B6:B1000,0),MATCH(\"S\",Keppendur!F5:H5,0)))","v":"S14"},"00:02:13.550",{"$f":"INDEX(Viðmið!$B$3:$T$19,MATCH(F82,Viðmið!$A$3:$A$19, 0),MATCH(\"50 bak\",Viðmið!$B$2:$T$2,0))","v":"00:00:30.124"},"DQ"]
[null,6,{"$f":"VLOOKUP(57,Keppendur!B6:C1000,2,FALSE)","v":"Arndís Atladóttir"},{"$f":"VLOOKUP(57,Keppendur!B6:D1000,3,FALSE)","v":15},{"$f":"VLOOKUP(57,Keppendur!B6:E1000,4,FALSE)","v":"Sundfélagið Óðinn             "},{"$f":"CONCATENATE(\"S\",INDEX(Keppendur!F6:H1000,MATCH(57,Keppendur!B6:B1000,0),MATCH(\"S\",Keppendur!F5:H5,0)))","v":"S14"},"00:02:00.530",{"$f":"INDEX(Viðmið!$B$3:$T$19,MATCH(F83,Viðmið!$A$3:$A$19, 0),MATCH(\"50 bak\",Viðmið!$B$2:$T$2,0))","v":"00:00:30.124"},"00:01:32.560",{"$f":"POWER((10*H:H/I:I),3)","v":34.470641369930981},{"$f":"IF(I83 < INDEX('Met25'!$B$3:$T$19,MATCH(F83,'Met25'!$A$3:$A$19, 0),MATCH(\"50 bak\",'Met25'!$B$2:$T$2,0)), \"X\", \"\")","v":""}]
[null,"Riðill #2",null,"Aldur",null,null,"Besti tími","Viðmið","Loka Tími","Stig","Met"]
[null,1,{"$f":"VLOOKUP(14,Keppendur!B6:C1000,2,FALSE)","v":"Guðbjörg S Sigfúsdóttir"},{"$f":"VLOOKUP(14,Keppendur!B6:D1000,3,FALSE)","v":15},{"$f":"VLOOKUP(14,Keppendur!B6:E1000,4,FALSE)","v":"Íþróttafélagið Fjörður        "},{"$f":"CONCATENATE(\"S\",INDEX(Keppendur!F6:H1000,MATCH(14,Keppendur!B6:B1000,0),MATCH(\"S\",Keppendur!F5:H5,0)))","v":"S14"},"00:01:37.980",{"$f":"INDEX(Viðmið!$B$3:$T$19,MATCH(F85,Viðmið!$A$3:$A$19, 0),MATCH(\"50 bak\",Viðmið!$B$2:$T$2,0))","v":"00:00:30.124"}]
[null,2,{"$f":"VLOOKUP(8,Keppendur!B6:C1000,2,FALSE)","v":"Katrín E Kristjánsdóttir"},{"$f":"VLOOKUP(8,Keppendur!B6:D1000,3,FALSE)","v":11},{"$f":"VLOOKUP(8,Keppendur!B6:E1000,4,FALSE)","v":"Íþróttafélagið Fjörður        "},{"$f":"CONCATENATE(\"S\",INDEX(Keppendur!F6:H1000,MATCH(8,Keppendur!B6:B1000,0),MATCH(\"S\",Keppendur!F5:H5,0)))","v":"S14"},"00:01:13.480",{"$f":"INDEX(Viðmið!$B$3:$T$19,MATCH(F86,Viðmið!$A$3:$A$19, 0),MATCH(\"50 bak\",Viðmið!$B$2:$T$2,0))","v":"00:00:30.124"},"00:01:05.270",{"$f":"POWER((10*H:H/I:I),3)","v":98.305669176558098},{"$f":"IF(I86 < INDEX('Met25'!$B$3:$T$19,MATCH(F86,'Met25'!$A$3:$A$19, 0),MATCH(\"50 bak\",'Met25'!$B$2:$T$2,0)), \"X\", \"\")","v":""}]
[null,3,{"$f":"VLOOKUP(26,Keppendur!B6:C1000,2,FALSE)","v":"Heiður B Egilsdóttir"},{"$f":"VLOOKUP(26,Keppendur!B6:D1000,3,FALSE)","v":11},{"$f":"VLOOKUP(26,Keppendur!B6:E1000,4,FALSE)","v":"ÍFR                           "},{"$f":"CONCATENATE(\"S\",INDEX(Keppendur!F6:H1000,MATCH(26,Keppendur!B6:B1000,0),MATCH(\"S\",Keppendur!F5:H5,0)))","v":"S8"},"00:01:09.430",{"$f":"INDEX(Viðmið!$B$3:$T$19,MATCH(F87,Viðmið!$A$3:$A$19, 0),MATCH(\"50 bak\",Viðmið!$B$2:$T$2,0))","v":"00:00:36.046"},"DQ"]
[null,4,{"$f":"VLOOKUP(5,Keppendur!B6:C1000,2,FALSE)","v":"Anna R Þrastardóttir"},{"$f":"VLOOKUP(5,Keppendur!B6:D1000,3,FALSE)","v":10},{"$f":"VLOOKUP(5,Keppendur!B6:E1000,4,FALSE)","v":"Íþróttafélagið Fjörður        "},{"$f":"CONCATENATE(\"S\",INDEX(Keppendur!F6:H1000,MATCH(5,Keppendur!B6:B1000,0),MATCH(\"S\",Keppendur!F5:H5,0)))","v":"S14"},"00:01:04.560",{"$f":"INDEX(Viðmið!$B$3:$T$19,MATCH(F88,Viðmið!$A$3:$A$19, 0),MATCH(\"50 bak\",Viðmið!$B$2:$T$2,0))","v":"00:00:30.124"},"00:01:05.560",{"$f":"POWER((10*H:H/I:I),3)","v":97.006886807392078},{"$f":"IF(I88 < INDEX('Met25'!$B$3:$T$19,MATCH(F88,'Met25'!$A$3:$A$19, 0),MATCH(\"50 bak\",'Met25'!$B$2:$T$2,0)), \"X\", \"\")","v":""}]
[null,5,{"$f":"VLOOKUP(11,Keppendur!B6:C1000,2,FALSE)","v":"Victoria L Karenardóttir"},{"$f":"VLOOKUP(11,Keppendur!B6:D1000,3,FALSE)","v":0},{"$f":"VLOOKUP(11,Keppendur!B6:E1000,4,FALSE)","v":"Íþróttafélagið Fjörður        "},{"$f":"CONCATENATE(\"S\",INDEX(Keppendur!F6:H1000,MATCH(11,Keppendur!B6:B1000,0),MATCH(\"S\",Keppendur!F5:H5,0)))","v":"S14"},"00:01:09.070",{"$f":"INDEX(Viðmið!$B$3:$T$19,MATCH(F89,Viðmið!$A$3:$A$19, 0),MATCH(\"50 bak\",Viðmið!$B$2:$T$2,0))","v":"00:00:30.124"},"00:01:06.070",{"$f":"POWER((10*H:H/I:I),3)","v":94.777768996004724},{"$f":"IF(I89 < INDEX('Met25'!$B$3:$T$19,MATCH(F89,'Met25'!$A$3:$A$19, 0),MATCH(\"50 bak\",'Met25'!$B$2:$T$2,0)), \"X\", \"\")","v":""}]
[null,6,{"$f":"VLOOKUP(12,Keppendur!B6:C1000,2,FALSE)","v":"Sigrún Kjartansdóttir"},{"$f":"VLOOKUP(12,Keppendur!B6:D1000,3,FALSE)","v":0},{"$f":"VLOOKUP(12,Keppendur!B6:E1000,4,FALSE)","v":"Íþróttafélagið Fjörður        "},{"$f":"CONCATENATE(\"S\",INDEX(Keppendur!F6:H1000,MATCH(12,Keppendur!B6:B1000,0),MATCH(\"S\",Keppendur!F5:H5,0)))","v":"S14"},"00:01:10.570",{"$f":"INDEX(Viðmið!$B$3:$T$19,MATCH(F90,Viðmið!$A$3:$A$19, 0),MATCH(\"50 bak\",Viðmið!$B$2:$T$2,0))","v":"00:00:30.124"},"00:01:23.190",{"$f":"POWER((10*H:H/I:I),3)","v":47.479488215625835},{"$f":"IF(I90 < INDEX('Met25'!$B$3:$T$19,MATCH(F90,'Met25'!$A$3:$A$19, 0),MATCH(\"50 bak\",'Met25'!$B$2:$T$2,0)), \"X\", \"\")","v":""}]
[null,7,{"$f":"VLOOKUP(6,Keppendur!B6:C1000,2,FALSE)","v":"Nevena Cupovic"},{"$f":"VLOOKUP(6,Keppendur!B6:D1000,3,FALSE)","v":15},{"$f":"VLOOKUP(6,Keppendur!B6:E1000,4,FALSE)","v":"Íþróttafélagið Fjörður        "},{"$f":"CONCATENATE(\"S\",INDEX(Keppendur!F6:H1000,MATCH(6,Keppendur!B6:B1000,0),MATCH(\"S\",Keppendur!F5:H5,0)))","v":"S14"},"00:01:19.450",{"$f":"INDEX(Viðmið!$B$3:$T$19,MATCH(F91,Viðmið!$A$3:$A$19, 0),MATCH(\"50 bak\",Viðmið!$B$2:$T$2,0))","v":"00:00:30.124"}]
[null,"Riðill #3",null,"Aldur",null,null,"Besti tími","Viðmið","Loka Tími","Stig","Met"]
[null,1,{"$f":"VLOOKUP(59,Keppendur!B6:C1000,2,FALSE)","v":"Tinna Rut Andrésdóttir"},{"$f":"VLOOKUP(59,Keppendur!B6:D1000,3,FALSE)","v":16},{"$f":"VLOOKUP(59,Keppendur!B6:E1000,4,FALSE)","v":"Sundfélagið Óðinn             "},{"$f":"CONCATENATE(\"S\",INDEX(Keppendur!F6:H1000,MATCH(59,Keppendur!B6:B1000,0),MATCH(\"S\",Keppendur!F5:H5,0)))","v":"S14"},"00:00:53.300",{"$f":"INDEX(Viðmið!$B$3:$T$19,MATCH(F93,Viðmið!$A$3:$A$19, 0),MATCH(\"50 bak\",Viðmið!$B$2:$T$2,0))","v":"00:00:30.124"},"00:00:44.570",{"$f":"POWER((10*H:H/I:I),3)","v":308.73900462239129},{"$f":"IF(I93 < INDEX('Met25'!$B$3:$T$19,MATCH(F93,'Met25'!$A$3:$A$19, 0),MATCH(\"50 bak\",'Met25'!$B$2:$T$2,0)), \"X\", \"\")","v":""}]
[null,2,{"$f":"VLOOKUP(67,Keppendur!B6:C1000,2,FALSE)","v":"Sandra S Gunnarsdóttir"},{"$f":"VLOOKUP(67,Keppendur!B6:D1000,3,FALSE)","v":16},{"$f":"VLOOKUP(67,Keppendur!B6:E1000,4,FALSE)","v":"Sunddeild Fjölnis             "},{"$f":"CONCATENATE(\"S\",INDEX(Keppendur!F6:H1000,MATCH(67,Keppendur!B6:B1000,0),MATCH(\"S\",Keppendur!F5:H5,0)))","v":"S12"},"00:00:46.070",{"$f":"INDEX(Viðmið!$B$3:$T$19,MATCH(F94,Viðmið!$A$3:$A$19, 0),MATCH(\"50 bak\",Viðmið!$B$2:$T$2,0))","v":"00:00:30.799"},"00:00:45.420",{"$f":"POWER((10*H:H/I:I),3)","v":311.78463990393448},{"$f":"IF(I94 < INDEX('Met25'!$B$3:$T$19,MATCH(F94,'Met25'!$A$3:$A$19, 0),MATCH(\"50 bak\",'Met25'!$B$2:$T$2,0)), \"X\", \"\")","v":""},{"$f":"IF(I94<K94,\"x\",\"\")","v":"x"},{"$f":"I94","v":"00:00:45.420"}]
[null,4,{"$f":"VLOOKUP(20,Keppendur!B6:C1000,2,FALSE)","v":"Thórey Í Magnúsdóttir"},{"$f":"VLOOKUP(20,Keppendur!B6:D1000,3,FALSE)","v":16},{"$f":"VLOOKUP(20,Keppendur!B6:E1000,4,FALSE)","v":"ÍFR                           "},{"$f":"CONCATENATE(\"S\",INDEX(Keppendur!F6:H1000,MATCH(20,Keppendur!B6:B1000,0),MATCH(\"S\",Keppendur!F5:H5,0)))","v":"S14"},"00:00:40.360",{"$f":"INDEX(Viðmið!$B$3:$T$19,MATCH(F95,Viðmið!$A$3:$A$19, 0),MATCH(\"50 bak\",Viðmið!$B$2:$T$2,0))","v":"00:00:30.124"},"00:00:40.840",{"$f":"POWER((10*H:H/I:I),3)","v":401.29357060835179},{"$f":"IF(I95 < INDEX('Met25'!$B$3:$T$19,MATCH(F95,'Met25'!$A$3:$A$19, 0),MATCH(\"50 bak\",'Met25'!$B$2:$T$2,0)), \"X\", \"\")","v":""},null,{"$f":"K94","v":""}]
[null,5,{"$f":"VLOOKUP(36,Keppendur!B6:C1000,2,FALSE)","v":"Ástrós M Bjarnadóttir"},{"$f":"VLOOKUP(36,Keppendur!B6:D1000,3,FALSE)","v":16},{"$f":"VLOOKUP(36,Keppendur!B6:E1000,4,FALSE)","v":"NES                           "},{"$f":"CONCATENATE(\"S\",INDEX(Keppendur!F6:H1000,MATCH(36,Keppendur!B6:B1000,0),MATCH(\"S\",Keppendur!F5:H5,0)))","v":"S18"},"00:00:42",{"$f":"INDEX(Viðmið!$B$3:$T$19,MATCH(F96,Viðmið!$A$3:$A$19, 0),MATCH(\"50 bak\",Viðmið!$B$2:$T$2,0))","v":"00:00:30.600"},"00:00:46.490",{"$f":"POWER((10*H:H/I:I),3)","v":285.15805307681319},{"$f":"IF(I96 < INDEX('Met25'!$B$3:$T$19,MATCH(F96,'Met25'!$A$3:$A$19, 0),MATCH(\"50 bak\",'Met25'!$B$2:$T$2,0)), \"X\", \"\")","v":""}]
[null,6,{"$f":"VLOOKUP(7,Keppendur!B6:C1000,2,FALSE)","v":"Sigríður Aníta Rögnvaldsóttir"},{"$f":"VLOOKUP(7,Keppendur!B6:D1000,3,FALSE)","v":13},{"$f":"VLOOKUP(7,Keppendur!B6:E1000,4,FALSE)","v":"Íþróttafélagið Fjörður        "},{"$f":"CONCATENATE(\"S\",INDEX(Keppendur!F6:H1000,MATCH(7,Keppendur!B6:B1000,0),MATCH(\"S\",Keppendur!F5:H5,0)))","v":"S14"},"00:00:44.330",{"$f":"INDEX(Viðmið!$B$3:$T$19,MATCH(F97,Viðmið!$A$3:$A$19, 0),MATCH(\"50 bak\",Viðmið!$B$2:$T$2,0))","v":"00:00:30.124"}]
[null,7,{"$f":"VLOOKUP(43,Keppendur!B6:C1000,2,FALSE)","v":"Matthildur E Sigurðardóttir"},{"$f":"VLOOKUP(43,Keppendur!B6:D1000,3,FALSE)","v":10},{"$f":"VLOOKUP(43,Keppendur!B6:E1000,4,FALSE)","v":"NES                           "},{"$f":"CONCATENATE(\"S\",INDEX(Keppendur!F6:H1000,MATCH(43,Keppendur!B6:B1000,0),MATCH(\"S\",Keppendur!F5:H5,0)))","v":"S10"},"00:00:52",{"$f":"INDEX(Viðmið!$B$3:$T$19,MATCH(F98,Viðmið!$A$3:$A$19, 0),MATCH(\"50 bak\",Viðmið!$B$2:$T$2,0))","v":"00:00:30.664"}]
[null,8,{"$f":"VLOOKUP(32,Keppendur!B6:C1000,2,FALSE)","v":"Gunnhildur Brynja Be"},{"$f":"VLOOKUP(32,Keppendur!B6:D1000,3,FALSE)","v":14},{"$f":"VLOOKUP(32,Keppendur!B6:E1000,4,FALSE)","v":"Íþróttafélagið Ösp            "},{"$f":"CONCATENATE(\"S\",INDEX(Keppendur!F6:H1000,MATCH(32,Keppendur!B6:B1000,0),MATCH(\"S\",Keppendur!F5:H5,0)))","v":"S14"},"00:00:53.930",{"$f":"INDEX(Viðmið!$B$3:$T$19,MATCH(F99,Viðmið!$A$3:$A$19, 0),MATCH(\"50 bak\",Viðmið!$B$2:$T$2,0))","v":"00:00:30.124"},"00:01:10.570",{"$f":"POWER((10*H:H/I:I),3)","v":77.778408004251759},{"$f":"IF(I99 < INDEX('Met25'!$B$3:$T$19,MATCH(F99,'Met25'!$A$3:$A$19, 0),MATCH(\"50 bak\",'Met25'!$B$2:$T$2,0)), \"X\", \"\")","v":""}]
[]
[]
[]
[]
[]
[]
[]
[]
[]
[]
[]
[]
[]
[]
[]
[]
[]
[]
[]
[]
[]
[]
[]
[]
[]
[]
[]
[]
[]
[]
[]
[]
[]
[]
[]
[]
[]
[]
[]
[]
[]
[]
[]
[]
[]
[]
[]
[null,"3. Grein: Drengir 50m Bringusund"]
[]
[null,0,{"$f":"VLOOKUP(42,Keppendur!B6:C1000,2,FALSE)","v":"Róbert Salvar Reynisson"},{"$f":"VLOOKUP(42,Keppendur!B6:D1000,3,FALSE)","v":16},{"$f":"VLOOKUP(42,Keppendur!B6:E1000,4,FALSE)","v":"NES                           "},{"$f":"CONCATENATE(\"S\",INDEX(Keppendur!F6:H1000,MATCH(42,Keppendur!B6:B1000,0),MATCH(\"SB\",Keppendur!F5:H5,0)))","v":"S9"},"00:00:53",{"$f":"INDEX(Viðmið!$B$23:$T$39,MATCH(F149,Viðmið!$A$23:$A$39, 0),MATCH(\"50 bringa\",Viðmið!$B$22:$T$22,0))","v":"00:00:29.202"}]
[null,"Riðill #1",null,"Aldur",null,null,"Besti tími","Viðmið","Loka Tími","Stig","Met"]
[null,4,{"$f":"VLOOKUP(35,Keppendur!B6:C1000,2,FALSE)","v":"Leó Baldurrson"},{"$f":"VLOOKUP(35,Keppendur!B6:D1000,3,FALSE)","v":10},{"$f":"VLOOKUP(35,Keppendur!B6:E1000,4,FALSE)","v":"NES                           "},{"$f":"CONCATENATE(\"S\",INDEX(Keppendur!F6:H1000,MATCH(35,Keppendur!B6:B1000,0),MATCH(\"SB\",Keppendur!F5:H5,0)))","v":"S14"},"00:00:00",{"$f":"INDEX(Viðmið!$B$23:$T$39,MATCH(F151,Viðmið!$A$23:$A$39, 0),MATCH(\"50 bringa\",Viðmið!$B$22:$T$22,0))","v":"00:00:30.420"},"00:01:19.380",{"$f":"POWER((10*H:H/I:I),3)","v":56.280979711293838},{"$f":"IF(I151 < INDEX('Met25'!$B$23:$T$39,MATCH(F151,'Met25'!$A$23:$A$39, 0),MATCH(\"50 bringa\",'Met25'!$B$22:$T$22,0)), \"X\", \"\")","v":""}]
[null,5,{"$f":"VLOOKUP(28,Keppendur!B6:C1000,2,FALSE)","v":"Snævar Örn Kristmannsson"},{"$f":"VLOOKUP(28,Keppendur!B6:D1000,3,FALSE)","v":9},{"$f":"VLOOKUP(28,Keppendur!B6:E1000,4,FALSE)","v":"ÍFR                           "},{"$f":"CONCATENATE(\"S\",INDEX(Keppendur!F6:H1000,MATCH(28,Keppendur!B6:B1000,0),MATCH(\"SB\",Keppendur!F5:H5,0)))","v":"S14"},"00:00:00",{"$f":"INDEX(Viðmið!$B$23:$T$39,MATCH(F152,Viðmið!$A$23:$A$39, 0),MATCH(\"50 bringa\",Viðmið!$B$22:$T$22,0))","v":"00:00:30.420"},"00:01:18.540",{"$f":"POWER((10*H:H/I:I),3)","v":58.1061688426689},{"$f":"IF(I152 < INDEX('Met25'!$B$23:$T$39,MATCH(F152,'Met25'!$A$23:$A$39, 0),MATCH(\"50 bringa\",'Met25'!$B$22:$T$22,0)), \"X\", \"\")","v":""}]
[null,6,{"$f":"VLOOKUP(2,Keppendur!B6:C1000,2,FALSE)","v":"Unnar I Ingason"},{"$f":"VLOOKUP(2,Keppendur!B6:D1000,3,FALSE)","v":14},{"$f":"VLOOKUP(2,Keppendur!B6:E1000,4,FALSE)","v":"Íþróttafélagið Fjörður        "},{"$f":"CONCATENATE(\"S\",INDEX(Keppendur!F6:H1000,MATCH(2,Keppendur!B6:B1000,0),MATCH(\"SB\",Keppendur!F5:H5,0)))","v":"S14"},"00:00:00",{"$f":"INDEX(Viðmið!$B$23:$T$39,MATCH(F153,Viðmið!$A$23:$A$39, 0),MATCH(\"50 bringa\",Viðmið!$B$22:$T$22,0))","v":"00:00:30.420"},"DQ"]
[null,"Riðill #2",null,"Aldur",null,null,"Besti tími","Viðmið","Loka Tími","Stig","Met"]
[null,1,{"$f":"VLOOKUP(16,Keppendur!B6:C1000,2,FALSE)","v":"Haukur H Loftsson"},{"$f":"VLOOKUP(16,Keppendur!B6:D1000,3,FALSE)","v":15},{"$f":"VLOOKUP(16,Keppendur!B6:E1000,4,FALSE)","v":"ÍFR                           "},{"$f":"CONCATENATE(\"S\",INDEX(Keppendur!F6:H1000,MATCH(16,Keppendur!B6:B1000,0),MATCH(\"SB\",Keppendur!F5:H5,0)))","v":"S4"},"00:02:36.020",{"$f":"INDEX(Viðmið!$B$23:$T$39,MATCH(F155,Viðmið!$A$23:$A$39, 0),MATCH(\"50 bringa\",Viðmið!$B$22:$T$22,0))","v":"00:00:42.089"},"DQ"]
[null,2,{"$f":"VLOOKUP(30,Keppendur!B6:C1000,2,FALSE)","v":"Jóhann Stígur Eiríksson"},{"$f":"VLOOKUP(30,Keppendur!B6:D1000,3,FALSE)","v":15},{"$f":"VLOOKUP(30,Keppendur!B6:E1000,4,FALSE)","v":"Íþróttafélagið Ösp            "},{"$f":"CONCATENATE(\"S\",INDEX(Keppendur!F6:H1000,MATCH(30,Keppendur!B6:B1000,0),MATCH(\"SB\",Keppendur!F5:H5,0)))","v":"S14"},"00:01:40.560",{"$f":"INDEX(Viðmið!$B$23:$T$39,MATCH(F156,Viðmið!$A$23:$A$39, 0),MATCH(\"50 bringa\",Viðmið!$B$22:$T$22,0))","v":"00:00:30.420"},"00:01:49.990",{"$f":"POWER((10*H:H/I:I),3)","v":21.156086127396456},{"$f":"IF(I156 < INDEX('Met25'!$B$23:$T$39,MATCH(F156,'Met25'!$A$23:$A$39, 0),MATCH(\"50 bringa\",'Met25'!$B$22:$T$22,0)), \"X\", \"\")","v":""}]
[null,3,{"$f":"VLOOKUP(69,Keppendur!B6:C1000,2,FALSE)","v":"Hjalti G Guðmundsson"},{"$f":"VLOOKUP(69,Keppendur!B6:D1000,3,FALSE)","v":0},{"$f":"VLOOKUP(69,Keppendur!B6:E1000,4,FALSE)","v":"Íþróttafélagið Ösp            "},{"$f":"CONCATENATE(\"S\",INDEX(Keppendur!F6:H1000,MATCH(69,Keppendur!B6:B1000,0),MATCH(\"SB\",Keppendur!F5:H5,0)))","v":"S14"},"NT",{"$f":"INDEX(Viðmið!$B$23:$T$39,MATCH(F157,Viðmið!$A$23:$A$39, 0),MATCH(\"50 bringa\",Viðmið!$B$22:$T$22,0))","v":"00:00:30.420"},"DQ"]
[null,5,{"$f":"VLOOKUP(18,Keppendur!B6:C1000,2,FALSE)","v":"Reynir A Magnússon"},{"$f":"VLOOKUP(18,Keppendur!B6:D1000,3,FALSE)","v":14},{"$f":"VLOOKUP(18,Keppendur!B6:E1000,4,FALSE)","v":"ÍFR                           "},{"$f":"CONCATENATE(\"S\",INDEX(Keppendur!F6:H1000,MATCH(18,Keppendur!B6:B1000,0),MATCH(\"SB\",Keppendur!F5:H5,0)))","v":"S14"},"00:00:54.570",{"$f":"INDEX(Viðmið!$B$23:$T$39,MATCH(F158,Viðmið!$A$23:$A$39, 0),MATCH(\"50 bringa\",Viðmið!$B$22:$T$22,0))","v":"00:00:30.420"},"00:00:54.490",{"$f":"POWER((10*H:H/I:I),3)","v":173.99810114233861},{"$f":"IF(I158 < INDEX('Met25'!$B$23:$T$39,MATCH(F158,'Met25'!$A$23:$A$39, 0),MATCH(\"50 bringa\",'Met25'!$B$22:$T$22,0)), \"X\", \"\")","v":""}]
[null,6,{"$f":"VLOOKUP(38,Keppendur!B6:C1000,2,FALSE)","v":"Óskar F Björnsson"},{"$f":"VLOOKUP(38,Keppendur!B6:D1000,3,FALSE)","v":10},{"$f":"VLOOKUP(38,Keppendur!B6:E1000,4,FALSE)","v":"NES                           "},{"$f":"CONCATENATE(\"S\",INDEX(Keppendur!F6:H1000,MATCH(38,Keppendur!B6:B1000,0),MATCH(\"SB\",Keppendur!F5:H5,0)))","v":"S14"},"00:01:35",{"$f":"INDEX(Viðmið!$B$23:$T$39,MATCH(F159,Viðmið!$A$23:$A$39, 0),MATCH(\"50 bringa\",Viðmið!$B$22:$T$22,0))","v":"00:00:30.420"},"DQ"]
[null,"Riðill #3",null,"Aldur",null,null,"Besti tími","Viðmið","Loka Tími","Stig","Met"]
[null,1,{"$f":"VLOOKUP(39,Keppendur!B6:C1000,2,FALSE)","v":"Alexander Guðmundsson"},{"$f":"VLOOKUP(39,Keppendur!B6:D1000,3,FALSE)","v":12},{"$f":"VLOOKUP(39,Keppendur!B6:E1000,4,FALSE)","v":"NES                           "},{"$f":"CONCATENATE(\"S\",INDEX(Keppendur!F6:H1000,MATCH(39,Keppendur!B6:B1000,0),MATCH(\"SB\",Keppendur!F5:H5,0)))","v":"S14"},"00:00:51",{"$f":"INDEX(Viðmið!$B$23:$T$39,MATCH(F161,Viðmið!$A$23:$A$39, 0),MATCH(\"50 bringa\",Viðmið!$B$22:$T$22,0))","v":"00:00:30.420"},"00:01:08.040",{"$f":"POWER((10*H:H/I:I),3)","v":89.372111300804548},{"$f":"IF(I161 < INDEX('Met25'!$B$23:$T$39,MATCH(F161,'Met25'!$A$23:$A$39, 0),MATCH(\"50 bringa\",'Met25'!$B$22:$T$22,0)), \"X\", \"\")","v":""}]
[null,2,{"$f":"VLOOKUP(1,Keppendur!B6:C1000,2,FALSE)","v":"Hallgrímur A Heimisson"},{"$f":"VLOOKUP(1,Keppendur!B6:D1000,3,FALSE)","v":14},{"$f":"VLOOKUP(1,Keppendur!B6:E1000,4,FALSE)","v":"Íþróttafélagið Fjörður        "},{"$f":"CONCATENATE(\"S\",INDEX(Keppendur!F6:H1000,MATCH(1,Keppendur!B6:B1000,0),MATCH(\"SB\",Keppendur!F5:H5,0)))","v":"S14"},"00:00:46.940",{"$f":"INDEX(Viðmið!$B$23:$T$39,MATCH(F162,Viðmið!$A$23:$A$39, 0),MATCH(\"50 bringa\",Viðmið!$B$22:$T$22,0))","v":"00:00:30.420"}]
[null,3,{"$f":"VLOOKUP(40,Keppendur!B6:C1000,2,FALSE)","v":"Már Gunnarsson"},{"$f":"VLOOKUP(40,Keppendur!B6:D1000,3,FALSE)","v":16},{"$f":"VLOOKUP(40,Keppendur!B6:E1000,4,FALSE)","v":"NES                           "},{"$f":"CONCATENATE(\"S\",INDEX(Keppendur!F6:H1000,MATCH(40,Keppendur!B6:B1000,0),MATCH(\"SB\",Keppendur!F5:H5,0)))","v":"S12"},"00:00:42",{"$f":"INDEX(Viðmið!$B$23:$T$39,MATCH(F163,Viðmið!$A$23:$A$39, 0),MATCH(\"50 bringa\",Viðmið!$B$22:$T$22,0))","v":"00:00:29.225"},"00:00:43.030",{"$f":"POWER((10*H:H/I:I),3)","v":313.30181729421759},{"$f":"IF(I163 < INDEX('Met25'!$B$23:$T$39,MATCH(F163,'Met25'!$A$23:$A$39, 0),MATCH(\"50 bringa\",'Met25'!$B$22:$T$22,0)), \"X\", \"\")","v":""}]
[null,4,{"$f":"VLOOKUP(15,Keppendur!B6:C1000,2,FALSE)","v":"Björn  Axel Agnarsson"},{"$f":"VLOOKUP(15,Keppendur!B6:D1000,3,FALSE)","v":13},{"$f":"VLOOKUP(15,Keppendur!B6:E1000,4,FALSE)","v":"ÍFR                           "},{"$f":"CONCATENATE(\"S\",INDEX(Keppendur!F6:H1000,MATCH(15,Keppendur!B6:B1000,0),MATCH(\"SB\",Keppendur!F5:H5,0)))","v":"S20"},"00:00:38.970",{"$f":"INDEX(Viðmið!$B$23:$T$39,MATCH(F164,Viðmið!$A$23:$A$39, 0),MATCH(\"50 bringa\",Viðmið!$B$22:$T$22,0))","v":"00:00:26.420"},"00:00:38.610",{"$f":"POWER((10*H:H/I:I),3)","v":320.40481572573913},{"$f":"IF(I164 < INDEX('Met25'!$B$23:$T$39,MATCH(F164,'Met25'!$A$23:$A$39, 0),MATCH(\"50 bringa\",'Met25'!$B$22:$T$22,0)), \"X\", \"\")","v":""}]
[null,5,{"$f":"VLOOKUP(3,Keppendur!B6:C1000,2,FALSE)","v":"Róbert Í Jónsson"},{"$f":"VLOOKUP(3,Keppendur!B6:D1000,3,FALSE)","v":14},{"$f":"VLOOKUP(3,Keppendur!B6:E1000,4,FALSE)","v":"Íþróttafélagið Fjörður        "},{"$f":"CONCATENATE(\"S\",INDEX(Keppendur!F6:H1000,MATCH(3,Keppendur!B6:B1000,0),MATCH(\"SB\",Keppendur!F5:H5,0)))","v":"S14"},"00:00:39.430",{"$f":"INDEX(Viðmið!$B$23:$T$39,MATCH(F165,Viðmið!$A$23:$A$39, 0),MATCH(\"50 bringa\",Viðmið!$B$22:$T$22,0))","v":"00:00:30.420"},"00:00:36.690",{"$f":"POWER((10*H:H/I:I),3)","v":569.96973724321072},{"$f":"IF(I165 < INDEX('Met25'!$B$23:$T$39,MATCH(F165,'Met25'!$A$23:$A$39, 0),MATCH(\"50 bringa\",'Met25'!$B$22:$T$22,0)), \"X\", \"\")","v":""}]
[null,6,{"$f":"VLOOKUP(58,Keppendur!B6:C1000,2,FALSE)","v":"Fannar Logi Jóhannesson"},{"$f":"VLOOKUP(58,Keppendur!B6:D1000,3,FALSE)","v":15},{"$f":"VLOOKUP(58,Keppendur!B6:E1000,4,FALSE)","v":"Sundfélagið Óðinn             "},"S14","00:00:43.690",{"$f":"INDEX(Viðmið!$B$23:$T$39,MATCH(F166,Viðmið!$A$23:$A$39, 0),MATCH(\"50 bringa\",Viðmið!$B$22:$T$22,0))","v":"00:00:30.420"},"00:00:42.920",{"$f":"POWER((10*H:H/I:I),3)","v":356.05393731143675},{"$f":"IF(I166 < INDEX('Met25'!$B$23:$T$39,MATCH(F166,'Met25'!$A$23:$A$39, 0),MATCH(\"50 bringa\",'Met25'!$B$22:$T$22,0)), \"X\", \"\")","v":""}]
[null,7,{"$f":"VLOOKUP(37,Keppendur!B6:C1000,2,FALSE)","v":"Ingólfur M Bjarnason"},{"$f":"VLOOKUP(37,Keppendur!B6:D1000,3,FALSE)","v":15},{"$f":"VLOOKUP(37,Keppendur!B6:E1000,4,FALSE)","v":"NES                           "},{"$f":"CONCATENATE(\"S\",INDEX(Keppendur!F6:H1000,MATCH(37,Keppendur!B6:B1000,0),MATCH(\"SB\",Keppendur!F5:H5,0)))","v":"S10"},"00:00:50",{"$f":"INDEX(Viðmið!$B$23:$T$39,MATCH(F167,Viðmið!$A$23:$A$39, 0),MATCH(\"50 bringa\",Viðmið!$B$22:$T$22,0))","v":"00:00:00"},"00:01:02.240",{"$f":"POWER((10*H:H/I:I),3)","v":0},{"$f":"IF(I167 < INDEX('Met25'!$B$23:$T$39,MATCH(F167,'Met25'!$A$23:$A$39, 0),MATCH(\"50 bringa\",'Met25'!$B$22:$T$22,0)), \"X\", \"\")","v":""}]
[]
[]
[]
[]
[]
[]
[]
[]
[]
[]
[]
[]
[]
[]
[]
[]
[]
[]
[]
[]
[]
[]
[]
[]
[]
[]
[]
[]
[]
[]
[]
[]
[]
[]
[]
[]
[]
[]
[]
[]
[]
[]
[]
[]
[]
[]
[]
[]
[]
[null,"4. Grein: Stúlkur 50m Bringusund"]
[]
[null,0,{"$f":"VLOOKUP(41,Keppendur!B6:C1000,2,FALSE)","v":"Ingibjörg F Margeirsdóttir"},{"$f":"VLOOKUP(41,Keppendur!B6:D1000,3,FALSE)","v":16},{"$f":"VLOOKUP(41,Keppendur!B6:E1000,4,FALSE)","v":"NES                           "},{"$f":"CONCATENATE(\"S\",INDEX(Keppendur!F6:H1000,MATCH(41,Keppendur!B6:B1000,0),MATCH(\"SB\",Keppendur!F5:H5,0)))","v":"S14"},"00:00:47",{"$f":"INDEX(Viðmið!$B$3:$T$19,MATCH(F219,Viðmið!$A$3:$A$19, 0),MATCH(\"50 bringa\",Viðmið!$B$2:$T$2,0))","v":"00:00:34.084"}]
[null,"Riðill #1",null,"Aldur",null,null,"Besti tími","Viðmið","Loka Tími","Stig","Met"]
[null,1,{"$f":"VLOOKUP(13,Keppendur!B6:C1000,2,FALSE)","v":"Emelía Ý Gunnarsdóttir"},{"$f":"VLOOKUP(13,Keppendur!B6:D1000,3,FALSE)","v":9},{"$f":"VLOOKUP(13,Keppendur!B6:E1000,4,FALSE)","v":"Íþróttafélagið Fjörður        "},{"$f":"CONCATENATE(\"S\",INDEX(Keppendur!F6:H1000,MATCH(13,Keppendur!B6:B1000,0),MATCH(\"SB\",Keppendur!F5:H5,0)))","v":"S14"},"00:00:00",{"$f":"INDEX(Viðmið!$B$3:$T$19,MATCH(F221,Viðmið!$A$3:$A$19, 0),MATCH(\"50 bringa\",Viðmið!$B$2:$T$2,0))","v":"00:00:34.084"},"00:01:26.550",{"$f":"POWER((10*H:H/I:I),3)","v":61.073720023462059},{"$f":"IF(I221 < INDEX('Met25'!$B$3:$T$19,MATCH(F221,'Met25'!$A$3:$A$19, 0),MATCH(\"50 bringa\",'Met25'!$B$2:$T$2,0)), \"X\", \"\")","v":""}]
[null,2,{"$f":"VLOOKUP(14,Keppendur!B6:C1000,2,FALSE)","v":"Guðbjörg S Sigfúsdóttir"},{"$f":"VLOOKUP(14,Keppendur!B6:D1000,3,FALSE)","v":15},{"$f":"VLOOKUP(14,Keppendur!B6:E1000,4,FALSE)","v":"Íþróttafélagið Fjörður        "},{"$f":"CONCATENATE(\"S\",INDEX(Keppendur!F6:H1000,MATCH(14,Keppendur!B6:B1000,0),MATCH(\"SB\",Keppendur!F5:H5,0)))","v":"S14"},"00:00:00",{"$f":"INDEX(Viðmið!$B$3:$T$19,MATCH(F222,Viðmið!$A$3:$A$19, 0),MATCH(\"50 bringa\",Viðmið!$B$2:$T$2,0))","v":"00:00:34.084"}]
[null,3,{"$f":"VLOOKUP(11,Keppendur!B6:C1000,2,FALSE)","v":"Victoria L Karenardóttir"},{"$f":"VLOOKUP(11,Keppendur!B6:D1000,3,FALSE)","v":0},{"$f":"VLOOKUP(11,Keppendur!B6:E1000,4,FALSE)","v":"Íþróttafélagið Fjörður        "},{"$f":"CONCATENATE(\"S\",INDEX(Keppendur!F6:H1000,MATCH(11,Keppendur!B6:B1000,0),MATCH(\"SB\",Keppendur!F5:H5,0)))","v":"S14"},"00:01:36.400",{"$f":"INDEX(Viðmið!$B$3:$T$19,MATCH(F223,Viðmið!$A$3:$A$19, 0),MATCH(\"50 bringa\",Viðmið!$B$2:$T$2,0))","v":"00:00:34.084"},"DQ"]
[null,4,{"$f":"VLOOKUP(6,Keppendur!B6:C1000,2,FALSE)","v":"Nevena Cupovic"},{"$f":"VLOOKUP(6,Keppendur!B6:D1000,3,FALSE)","v":15},{"$f":"VLOOKUP(6,Keppendur!B6:E1000,4,FALSE)","v":"Íþróttafélagið Fjörður        "},{"$f":"CONCATENATE(\"S\",INDEX(Keppendur!F6:H1000,MATCH(6,Keppendur!B6:B1000,0),MATCH(\"SB\",Keppendur!F5:H5,0)))","v":"S14"},"00:01:32.310",{"$f":"INDEX(Viðmið!$B$3:$T$19,MATCH(F224,Viðmið!$A$3:$A$19, 0),MATCH(\"50 bringa\",Viðmið!$B$2:$T$2,0))","v":"00:00:34.084"}]
[null,5,{"$f":"VLOOKUP(57,Keppendur!B6:C1000,2,FALSE)","v":"Arndís Atladóttir"},{"$f":"VLOOKUP(57,Keppendur!B6:D1000,3,FALSE)","v":15},{"$f":"VLOOKUP(57,Keppendur!B6:E1000,4,FALSE)","v":"Sundfélagið Óðinn             "},{"$f":"CONCATENATE(\"S\",INDEX(Keppendur!F6:H1000,MATCH(57,Keppendur!B6:B1000,0),MATCH(\"SB\",Keppendur!F5:H5,0)))","v":"S14"},"00:01:33.600",{"$f":"INDEX(Viðmið!$B$3:$T$19,MATCH(F225,Viðmið!$A$3:$A$19, 0),MATCH(\"50 bringa\",Viðmið!$B$2:$T$2,0))","v":"00:00:34.084"},"DQ"]
[null,6,{"$f":"VLOOKUP(84,Keppendur!B6:C1000,2,FALSE)","v":"Birta Bjarnadóttir"},{"$f":"VLOOKUP(84,Keppendur!B6:D1000,3,FALSE)","v":12},{"$f":"VLOOKUP(84,Keppendur!B6:E1000,4,FALSE)","v":"NES                           "},"S14","00:01:01",{"$f":"INDEX(Viðmið!$B$3:$T$19,MATCH(F226,Viðmið!$A$3:$A$19, 0),MATCH(\"50 bringa\",Viðmið!$B$2:$T$2,0))","v":"00:00:34.084"},"00:00:57.600",{"$f":"POWER((10*H:H/I:I),3)","v":207.19923146459473},{"$f":"IF(I226 < INDEX('Met25'!$B$3:$T$19,MATCH(F226,'Met25'!$A$3:$A$19, 0),MATCH(\"50 bringa\",'Met25'!$B$2:$T$2,0)), \"X\", \"\")","v":""}]
[null,7,{"$f":"VLOOKUP(26,Keppendur!B6:C1000,2,FALSE)","v":"Heiður B Egilsdóttir"},{"$f":"VLOOKUP(26,Keppendur!B6:D1000,3,FALSE)","v":11},{"$f":"VLOOKUP(26,Keppendur!B6:E1000,4,FALSE)","v":"ÍFR                           "},{"$f":"CONCATENATE(\"S\",INDEX(Keppendur!F6:H1000,MATCH(26,Keppendur!B6:B1000,0),MATCH(\"SB\",Keppendur!F5:H5,0)))","v":"S8"},"00:00:00",{"$f":"INDEX(Viðmið!$B$3:$T$19,MATCH(F227,Viðmið!$A$3:$A$19, 0),MATCH(\"50 bringa\",Viðmið!$B$2:$T$2,0))","v":"00:00:35.353"},"00:01:27.730",{"$f":"1000*POWER((H:H/I:I),2.8)","v":78.484164026025326},{"$f":"IF(I227 < INDEX('Met25'!$B$3:$T$19,MATCH(F227,'Met25'!$A$3:$A$19, 0),MATCH(\"50 bringa\",'Met25'!$B$2:$T$2,0)), \"X\", \"\")","v":""}]
[null,8,{"$f":"VLOOKUP(12,Keppendur!B6:C1000,2,FALSE)","v":"Sigrún Kjartansdóttir"},{"$f":"VLOOKUP(12,Keppendur!B6:D1000,3,FALSE)","v":0},{"$f":"VLOOKUP(12,Keppendur!B6:E1000,4,FALSE)","v":"Íþróttafélagið Fjörður        "},{"$f":"CONCATENATE(\"S\",INDEX(Keppendur!F6:H1000,MATCH(12,Keppendur!B6:B1000,0),MATCH(\"SB\",Keppendur!F5:H5,0)))","v":"S14"},"00:00:00",{"$f":"INDEX(Viðmið!$B$3:$T$19,MATCH(F228,Viðmið!$A$3:$A$19, 0),MATCH(\"50 bringa\",Viðmið!$B$2:$T$2,0))","v":"00:00:34.084"},"DQ"]
[null,"Riðill #2",null,"Aldur",null,null,"Besti tími","Viðmið","Loka Tími","Stig","Met"]
[null,1,{"$f":"VLOOKUP(8,Keppendur!B6:C1000,2,FALSE)","v":"Katrín E Kristjánsdóttir"},{"$f":"VLOOKUP(8,Keppendur!B6:D1000,3,FALSE)","v":11},{"$f":"VLOOKUP(8,Keppendur!B6:E1000,4,FALSE)","v":"Íþróttafélagið Fjörður        "},{"$f":"CONCATENATE(\"S\",INDEX(Keppendur!F6:H1000,MATCH(8,Keppendur!B6:B1000,0),MATCH(\"SB\",Keppendur!F5:H5,0)))","v":"S14"},"00:01:10.600",{"$f":"INDEX(Viðmið!$B$3:$T$19,MATCH(F230,Viðmið!$A$3:$A$19, 0),MATCH(\"50 bringa\",Viðmið!$B$2:$T$2,0))","v":"00:00:34.084"},"00:01:18.320",{"$f":"POWER((10*H:H/I:I),3)","v":82.420938254744087},{"$f":"IF(I230 < INDEX('Met25'!$B$3:$T$19,MATCH(F230,'Met25'!$A$3:$A$19, 0),MATCH(\"50 bringa\",'Met25'!$B$2:$T$2,0)), \"X\", \"\")","v":""}]
[null,2,{"$f":"VLOOKUP(7,Keppendur!B6:C1000,2,FALSE)","v":"Sigríður Aníta Rögnvaldsóttir"},{"$f":"VLOOKUP(7,Keppendur!B6:D1000,3,FALSE)","v":13},{"$f":"VLOOKUP(7,Keppendur!B6:E1000,4,FALSE)","v":"Íþróttafélagið Fjörður        "},{"$f":"CONCATENATE(\"S\",INDEX(Keppendur!F6:H1000,MATCH(7,Keppendur!B6:B1000,0),MATCH(\"SB\",Keppendur!F5:H5,0)))","v":"S14"},"00:00:58.150",{"$f":"INDEX(Viðmið!$B$3:$T$19,MATCH(F231,Viðmið!$A$3:$A$19, 0),MATCH(\"50 bringa\",Viðmið!$B$2:$T$2,0))","v":"00:00:34.084"}]
[null,3,{"$f":"VLOOKUP(36,Keppendur!B6:C1000,2,FALSE)","v":"Ástrós M Bjarnadóttir"},{"$f":"VLOOKUP(36,Keppendur!B6:D1000,3,FALSE)","v":16},{"$f":"VLOOKUP(36,Keppendur!B6:E1000,4,FALSE)","v":"NES                           "},{"$f":"CONCATENATE(\"S\",INDEX(Keppendur!F6:H1000,MATCH(36,Keppendur!B6:B1000,0),MATCH(\"SB\",Keppendur!F5:H5,0)))","v":"S18"},"00:00:48",{"$f":"INDEX(Viðmið!$B$3:$T$19,MATCH(F232,Viðmið!$A$3:$A$19, 0),MATCH(\"50 bringa\",Viðmið!$B$2:$T$2,0))","v":"00:00:32.850"},"00:00:52.090",{"$f":"POWER((10*H:H/I:I),3)","v":250.8089611798668},{"$f":"IF(I232 < INDEX('Met25'!$B$3:$T$19,MATCH(F232,'Met25'!$A$3:$A$19, 0),MATCH(\"50 bringa\",'Met25'!$B$2:$T$2,0)), \"X\", \"\")","v":""}]
[null,4,{"$f":"VLOOKUP(20,Keppendur!B6:C1000,2,FALSE)","v":"Thórey Í Magnúsdóttir"},{"$f":"VLOOKUP(20,Keppendur!B6:D1000,3,FALSE)","v":16},{"$f":"VLOOKUP(20,Keppendur!B6:E1000,4,FALSE)","v":"ÍFR                           "},{"$f":"CONCATENATE(\"S\",INDEX(Keppendur!F6:H1000,MATCH(20,Keppendur!B6:B1000,0),MATCH(\"SB\",Keppendur!F5:H5,0)))","v":"S14"},"00:00:40.980",{"$f":"INDEX(Viðmið!$B$3:$T$19,MATCH(F233,Viðmið!$A$3:$A$19, 0),MATCH(\"50 bringa\",Viðmið!$B$2:$T$2,0))","v":"00:00:34.084"},"00:00:41.550",{"$f":"POWER((10*H:H/I:I),3)","v":552.00435759065499},{"$f":"IF(I233 < INDEX('Met25'!$B$3:$T$19,MATCH(F233,'Met25'!$A$3:$A$19, 0),MATCH(\"50 bringa\",'Met25'!$B$2:$T$2,0)), \"X\", \"\")","v":""}]
[null,6,{"$f":"VLOOKUP(59,Keppendur!B6:C1000,2,FALSE)","v":"Tinna Rut Andrésdóttir"},{"$f":"VLOOKUP(59,Keppendur!B6:D1000,3,FALSE)","v":16},{"$f":"VLOOKUP(59,Keppendur!B6:E1000,4,FALSE)","v":"Sundfélagið Óðinn             "},{"$f":"CONCATENATE(\"S\",INDEX(Keppendur!F6:H1000,MATCH(59,Keppendur!B6:B1000,0),MATCH(\"SB\",Keppendur!F5:H5,0)))","v":"S14"},"00:00:52.230",{"$f":"INDEX(Viðmið!$B$3:$T$19,MATCH(F234,Viðmið!$A$3:$A$19, 0),MATCH(\"50 bringa\",Viðmið!$B$2:$T$2,0))","v":"00:00:34.084"},"00:00:50.840",{"$f":"POWER((10*H:H/I:I),3)","v":301.32763627325511},{"$f":"IF(I234 < INDEX('Met25'!$B$3:$T$19,MATCH(F234,'Met25'!$A$3:$A$19, 0),MATCH(\"50 bringa\",'Met25'!$B$2:$T$2,0)), \"X\", \"\")","v":""}]
[null,7,{"$f":"VLOOKUP(67,Keppendur!B6:C1000,2,FALSE)","v":"Sandra S Gunnarsdóttir"},{"$f":"VLOOKUP(67,Keppendur!B6:D1000,3,FALSE)","v":16},{"$f":"VLOOKUP(67,Keppendur!B6:E1000,4,FALSE)","v":"Sunddeild Fjölnis             "},{"$f":"CONCATENATE(\"S\",INDEX(Keppendur!F6:H1000,MATCH(67,Keppendur!B6:B1000,0),MATCH(\"SB\",Keppendur!F5:H5,0)))","v":"S12"},"00:01:04.470",{"$f":"INDEX(Viðmið!$B$3:$T$19,MATCH(F235,Viðmið!$A$3:$A$19, 0),MATCH(\"50 bringa\",Viðmið!$B$2:$T$2,0))","v":"00:00:34.863"},"00:00:54.600",{"$f":"POWER((10*H:H/I:I),3)","v":260.32317115913435},{"$f":"IF(I235 < INDEX('Met25'!$B$3:$T$19,MATCH(F235,'Met25'!$A$3:$A$19, 0),MATCH(\"50 bringa\",'Met25'!$B$2:$T$2,0)), \"X\", \"\")","v":""}]
[null,8,{"$f":"VLOOKUP(5,Keppendur!B6:C1000,2,FALSE)","v":"Anna R Þrastardóttir"},{"$f":"VLOOKUP(5,Keppendur!B6:D1000,3,FALSE)","v":10},{"$f":"VLOOKUP(5,Keppendur!B6:E1000,4,FALSE)","v":"Íþróttafélagið Fjörður        "},{"$f":"CONCATENATE(\"S\",INDEX(Keppendur!F6:H1000,MATCH(5,Keppendur!B6:B1000,0),MATCH(\"SB\",Keppendur!F5:H5,0)))","v":"S14"},"00:01:13.080",{"$f":"INDEX(Viðmið!$B$3:$T$19,MATCH(F236,Viðmið!$A$3:$A$19, 0),MATCH(\"50 bringa\",Viðmið!$B$2:$T$2,0))","v":"00:00:34.084"},"00:01:15.620",{"$f":"POWER((10*H:H/I:I),3)","v":91.56838854959453},{"$f":"IF(I236 < INDEX('Met25'!$B$3:$T$19,MATCH(F236,'Met25'!$A$3:$A$19, 0),MATCH(\"50 bringa\",'Met25'!$B$2:$T$2,0)), \"X\", \"\")","v":""}]
[]
[]
[]
[]
[]
[]
[]
[]
[]
[]
[]
[]
[]
[]
[]
[]
[]
[]
[]
[]
[]
[]
[]
[]
[]
[]
[]
[]
[]
[]
[]
[]
[]
[]
[]
[]
[]
[]
[]
[]
[]
[]
[]
[]
[]
[]
[]
[]
[]
[]
[null,"5. Grein: Drengir 25m Skriðsund"]
[]
[]
[]
[]
[]
[]
[]
[]
[]
[]
[]
[]
[]
[]
[]
[]
[]
[]
[]
[]
[]
[]
[]
[]
[]
[]
[]
[]
[]
[]
[]
[]
[]
[]
[]
[]
[]
[]
[]
[]
[]
[]
[]
[]
[]
[]
[]
[]
[]
[]
[]
[]
[]
[]
[]
[]
[]
[]
[]
[]
[]
[]
[]
[]
[]
[]
[]
[]
[]
[null,"6. Grein: Stúlkur 25m Skriðsund"]
[]
[]
[]
[]
[]
[]
[]
[]
[]
[]
[]
[]
[]
[]
[]
[]
[]
[]
[]
[]
[null,null,null,null,null,null,null,null,null,null,null,660]
[]
[null,null,null,null,null,null,null,null,null,null,null,488]
[]
[]
[]
[]
[]
[]
[]
[]
[]
[]
[]
[]
[]
[]
[]
[]
[]
[]
[]
[]
[]
[]
[]
[]
[]
[]
[]
[]
[]
[]
[]
[]
[]
[]
[]
[]
[]
[]
[]
[]
[]
[]
[]
[]
[]
[]
[null,"7. Grein: Drengir 50m Skriðsund"]
[]
[null,0,{"$f":"VLOOKUP(42,Keppendur!B6:C1000,2,FALSE)","v":"Róbert Salvar Reynisson"},{"$f":"VLOOKUP(42,Keppendur!B6:D1000,3,FALSE)","v":16},{"$f":"VLOOKUP(42,Keppendur!B6:E1000,4,FALSE)","v":"NES                           "},{"$f":"CONCATENATE(\"S\",INDEX(Keppendur!F6:H1000,MATCH(42,Keppendur!B6:B1000,0),MATCH(\"S\",Keppendur!F5:H5,0)))","v":"S9"},"00:00:37",{"$f":"INDEX(Viðmið!$B$23:$T$39,MATCH(F429,Viðmið!$A$23:$A$39, 0),MATCH(\"50 skrið\",Viðmið!$B$22:$T$22,0))","v":"00:00:25.130"}]
[null,"Riðill #1",null,"Aldur",null,null,"Besti tími","Viðmið","Loka Tími","Stig","Met"]
[null,3,{"$f":"VLOOKUP(62,Keppendur!B6:C1000,2,FALSE)","v":"Logi Ingólfsson"},{"$f":"VLOOKUP(62,Keppendur!B6:D1000,3,FALSE)","v":9},{"$f":"VLOOKUP(62,Keppendur!B6:E1000,4,FALSE)","v":"Sundfélagið Óðinn             "},{"$f":"CONCATENATE(\"S\",INDEX(Keppendur!F6:H1000,MATCH(62,Keppendur!B6:B1000,0),MATCH(\"S\",Keppendur!F5:H5,0)))","v":"S20"},"00:00:00",{"$f":"INDEX(Viðmið!$B$23:$T$39,MATCH(F431,Viðmið!$A$23:$A$39, 0),MATCH(\"50 skrið\",Viðmið!$B$22:$T$22,0))","v":"00:00:20.910"},"00:01:53.600",{"$f":"POWER((10*H:H/I:I),3)","v":6.2363015131937063},{"$f":"IF(I431 < INDEX('Met25'!$B$23:$T$39,MATCH(F431,'Met25'!$A$23:$A$39, 0),MATCH(\"50 skrið\",'Met25'!$B$22:$T$22,0)), \"X\", \"\")","v":""}]
[null,4,{"$f":"VLOOKUP(16,Keppendur!B6:C1000,2,FALSE)","v":"Haukur H Loftsson"},{"$f":"VLOOKUP(16,Keppendur!B6:D1000,3,FALSE)","v":15},{"$f":"VLOOKUP(16,Keppendur!B6:E1000,4,FALSE)","v":"ÍFR                           "},{"$f":"CONCATENATE(\"S\",INDEX(Keppendur!F6:H1000,MATCH(16,Keppendur!B6:B1000,0),MATCH(\"S\",Keppendur!F5:H5,0)))","v":"S4"},"00:02:12.360",{"$f":"INDEX(Viðmið!$B$23:$T$39,MATCH(F432,Viðmið!$A$23:$A$39, 0),MATCH(\"50 skrið\",Viðmið!$B$22:$T$22,0))","v":"00:00:37.850"},"00:02:40.810",{"$f":"1000*POWER((H:H/I:I),2.4)","v":31.060382279628012},{"$f":"IF(I432 < INDEX('Met25'!$B$23:$T$39,MATCH(F432,'Met25'!$A$23:$A$39, 0),MATCH(\"50 skrið\",'Met25'!$B$22:$T$22,0)), \"X\", \"\")","v":""}]
[null,"Riðill #2",null,"Aldur",null,null,"Besti tími","Viðmið","Loka Tími","Stig","Met"]
[null,2,{"$f":"VLOOKUP(38,Keppendur!B6:C1000,2,FALSE)","v":"Óskar F Björnsson"},{"$f":"VLOOKUP(38,Keppendur!B6:D1000,3,FALSE)","v":10},{"$f":"VLOOKUP(38,Keppendur!B6:E1000,4,FALSE)","v":"NES                           "},{"$f":"CONCATENATE(\"S\",INDEX(Keppendur!F6:H1000,MATCH(38,Keppendur!B6:B1000,0),MATCH(\"S\",Keppendur!F5:H5,0)))","v":"S14"},"00:01:25",{"$f":"INDEX(Viðmið!$B$23:$T$39,MATCH(F434,Viðmið!$A$23:$A$39, 0),MATCH(\"50 skrið\",Viðmið!$B$22:$T$22,0))","v":"00:00:23.835"},"00:01:42.550",{"$f":"POWER((10*H:H/I:I),3)","v":12.5561821255688},{"$f":"IF(I434 < INDEX('Met25'!$B$23:$T$39,MATCH(F434,'Met25'!$A$23:$A$39, 0),MATCH(\"50 skrið\",'Met25'!$B$22:$T$22,0)), \"X\", \"\")","v":""}]
[null,3,{"$f":"VLOOKUP(9,Keppendur!B6:C1000,2,FALSE)","v":"Baldur M Kristinsson"},{"$f":"VLOOKUP(9,Keppendur!B6:D1000,3,FALSE)","v":10},{"$f":"VLOOKUP(9,Keppendur!B6:E1000,4,FALSE)","v":"Íþróttafélagið Fjörður        "},{"$f":"CONCATENATE(\"S\",INDEX(Keppendur!F6:H1000,MATCH(9,Keppendur!B6:B1000,0),MATCH(\"S\",Keppendur!F5:H5,0)))","v":"S14"},"00:01:17.730",{"$f":"INDEX(Viðmið!$B$23:$T$39,MATCH(F435,Viðmið!$A$23:$A$39, 0),MATCH(\"50 skrið\",Viðmið!$B$22:$T$22,0))","v":"00:00:23.835"},"00:01:02.580",{"$f":"POWER((10*H:H/I:I),3)","v":55.253262187379462},{"$f":"IF(I435 < INDEX('Met25'!$B$23:$T$39,MATCH(F435,'Met25'!$A$23:$A$39, 0),MATCH(\"50 skrið\",'Met25'!$B$22:$T$22,0)), \"X\", \"\")","v":""}]
[null,4,{"$f":"VLOOKUP(33,Keppendur!B6:C1000,2,FALSE)","v":"Þorleifur Pálmi Páls"},{"$f":"VLOOKUP(33,Keppendur!B6:D1000,3,FALSE)","v":12},{"$f":"VLOOKUP(33,Keppendur!B6:E1000,4,FALSE)","v":"Íþróttafélagið Ösp            "},{"$f":"CONCATENATE(\"S\",INDEX(Keppendur!F6:H1000,MATCH(33,Keppendur!B6:B1000,0),MATCH(\"S\",Keppendur!F5:H5,0)))","v":"S14"},"00:01:17.250",{"$f":"INDEX(Viðmið!$B$23:$T$39,MATCH(F436,Viðmið!$A$23:$A$39, 0),MATCH(\"50 skrið\",Viðmið!$B$22:$T$22,0))","v":"00:00:23.835"},"00:01:23.690",{"$f":"POWER((10*H:H/I:I),3)","v":23.101697723665996},{"$f":"IF(I436 < INDEX('Met25'!$B$23:$T$39,MATCH(F436,'Met25'!$A$23:$A$39, 0),MATCH(\"50 skrið\",'Met25'!$B$22:$T$22,0)), \"X\", \"\")","v":""}]
[null,5,{"$f":"VLOOKUP(69,Keppendur!B6:C1000,2,FALSE)","v":"Hjalti G Guðmundsson"},{"$f":"VLOOKUP(69,Keppendur!B6:D1000,3,FALSE)","v":0},{"$f":"VLOOKUP(69,Keppendur!B6:E1000,4,FALSE)","v":"Íþróttafélagið Ösp            "},{"$f":"CONCATENATE(\"S\",INDEX(Keppendur!F6:H1000,MATCH(69,Keppendur!B6:B1000,0),MATCH(\"S\",Keppendur!F5:H5,0)))","v":"S14"},"NT",{"$f":"INDEX(Viðmið!$B$23:$T$39,MATCH(F437,Viðmið!$A$23:$A$39, 0),MATCH(\"50 skrið\",Viðmið!$B$22:$T$22,0))","v":"00:00:23.835"},"00:00:56.940",{"$f":"POWER((10*H:H/I:I),3)","v":73.352042631844654},{"$f":"IF(I437 < INDEX('Met25'!$B$23:$T$39,MATCH(F437,'Met25'!$A$23:$A$39, 0),MATCH(\"50 skrið\",'Met25'!$B$22:$T$22,0)), \"X\", \"\")","v":""}]
[null,7,{"$f":"VLOOKUP(4,Keppendur!B6:C1000,2,FALSE)","v":"Guðmundur A Sigurðsson"},{"$f":"VLOOKUP(4,Keppendur!B6:D1000,3,FALSE)","v":10},{"$f":"VLOOKUP(4,Keppendur!B6:E1000,4,FALSE)","v":"Íþróttafélagið Fjörður        "},{"$f":"CONCATENATE(\"S\",INDEX(Keppendur!F6:H1000,MATCH(4,Keppendur!B6:B1000,0),MATCH(\"S\",Keppendur!F5:H5,0)))","v":"S10"},"00:01:43.750",{"$f":"INDEX(Viðmið!$B$23:$T$39,MATCH(F438,Viðmið!$A$23:$A$39, 0),MATCH(\"50 skrið\",Viðmið!$B$22:$T$22,0))","v":"00:00:23.160"}]
[null,8,{"$f":"VLOOKUP(35,Keppendur!B6:C1000,2,FALSE)","v":"Leó Baldurrson"},{"$f":"VLOOKUP(35,Keppendur!B6:D1000,3,FALSE)","v":10},{"$f":"VLOOKUP(35,Keppendur!B6:E1000,4,FALSE)","v":"NES                           "},{"$f":"CONCATENATE(\"S\",INDEX(Keppendur!F6:H1000,MATCH(35,Keppendur!B6:B1000,0),MATCH(\"S\",Keppendur!F5:H5,0)))","v":"S14"},"00:01:15",{"$f":"INDEX(Viðmið!$B$23:$T$39,MATCH(F439,Viðmið!$A$23:$A$39, 0),MATCH(\"50 skrið\",Viðmið!$B$22:$T$22,0))","v":"00:00:23.835"},"00:01:04.500",{"$f":"POWER((10*H:H/I:I),3)","v":50.464439811153454},{"$f":"IF(I439 < INDEX('Met25'!$B$23:$T$39,MATCH(F439,'Met25'!$A$23:$A$39, 0),MATCH(\"50 skrið\",'Met25'!$B$22:$T$22,0)), \"X\", \"\")","v":""}]
[null,"Riðill #3",null,"Aldur",null,null,"Besti tími","Viðmið","Loka Tími","Stig","Met"]
[null,2,{"$f":"VLOOKUP(2,Keppendur!B6:C1000,2,FALSE)","v":"Unnar I Ingason"},{"$f":"VLOOKUP(2,Keppendur!B6:D1000,3,FALSE)","v":14},{"$f":"VLOOKUP(2,Keppendur!B6:E1000,4,FALSE)","v":"Íþróttafélagið Fjörður        "},{"$f":"CONCATENATE(\"S\",INDEX(Keppendur!F6:H1000,MATCH(2,Keppendur!B6:B1000,0),MATCH(\"S\",Keppendur!F5:H5,0)))","v":"S14"},"00:00:59.420",{"$f":"INDEX(Viðmið!$B$23:$T$39,MATCH(F441,Viðmið!$A$23:$A$39, 0),MATCH(\"50 skrið\",Viðmið!$B$22:$T$22,0))","v":"00:00:23.835"},"00:00:48.010",{"$f":"POWER((10*H:H/I:I),3)","v":122.36845666294093},{"$f":"IF(I441 < INDEX('Met25'!$B$23:$T$39,MATCH(F441,'Met25'!$A$23:$A$39, 0),MATCH(\"50 skrið\",'Met25'!$B$22:$T$22,0)), \"X\", \"\")","v":""}]
[null,3,{"$f":"VLOOKUP(28,Keppendur!B6:C1000,2,FALSE)","v":"Snævar Örn Kristmannsson"},{"$f":"VLOOKUP(28,Keppendur!B6:D1000,3,FALSE)","v":9},{"$f":"VLOOKUP(28,Keppendur!B6:E1000,4,FALSE)","v":"ÍFR                           "},{"$f":"CONCATENATE(\"S\",INDEX(Keppendur!F6:H1000,MATCH(28,Keppendur!B6:B1000,0),MATCH(\"S\",Keppendur!F5:H5,0)))","v":"S14"},"00:00:51.320",{"$f":"INDEX(Viðmið!$B$23:$T$39,MATCH(F442,Viðmið!$A$23:$A$39, 0),MATCH(\"50 skrið\",Viðmið!$B$22:$T$22,0))","v":"00:00:23.835"},"00:00:53.010",{"$f":"POWER((10*H:H/I:I),3)","v":90.905715181730656},{"$f":"IF(I442 < INDEX('Met25'!$B$23:$T$39,MATCH(F442,'Met25'!$A$23:$A$39, 0),MATCH(\"50 skrið\",'Met25'!$B$22:$T$22,0)), \"X\", \"\")","v":""}]
[null,4,{"$f":"VLOOKUP(18,Keppendur!B6:C1000,2,FALSE)","v":"Reynir A Magnússon"},{"$f":"VLOOKUP(18,Keppendur!B6:D1000,3,FALSE)","v":14},{"$f":"VLOOKUP(18,Keppendur!B6:E1000,4,FALSE)","v":"ÍFR                           "},{"$f":"CONCATENATE(\"S\",INDEX(Keppendur!F6:H1000,MATCH(18,Keppendur!B6:B1000,0),MATCH(\"S\",Keppendur!F5:H5,0)))","v":"S14"},"00:00:50.170",{"$f":"INDEX(Viðmið!$B$23:$T$39,MATCH(F443,Viðmið!$A$23:$A$39, 0),MATCH(\"50 skrið\",Viðmið!$B$22:$T$22,0))","v":"00:00:23.835"},"00:00:57.380",{"$f":"POWER((10*H:H/I:I),3)","v":71.677519711783773},{"$f":"IF(I443 < INDEX('Met25'!$B$23:$T$39,MATCH(F443,'Met25'!$A$23:$A$39, 0),MATCH(\"50 skrið\",'Met25'!$B$22:$T$22,0)), \"X\", \"\")","v":""}]
[null,6,{"$f":"VLOOKUP(30,Keppendur!B6:C1000,2,FALSE)","v":"Jóhann Stígur Eiríksson"},{"$f":"VLOOKUP(30,Keppendur!B6:D1000,3,FALSE)","v":15},{"$f":"VLOOKUP(30,Keppendur!B6:E1000,4,FALSE)","v":"Íþróttafélagið Ösp            "},{"$f":"CONCATENATE(\"S\",INDEX(Keppendur!F6:H1000,MATCH(30,Keppendur!B6:B1000,0),MATCH(\"S\",Keppendur!F5:H5,0)))","v":"S14"},"00:00:51.320",{"$f":"INDEX(Viðmið!$B$23:$T$39,MATCH(F444,Viðmið!$A$23:$A$39, 0),MATCH(\"50 skrið\",Viðmið!$B$22:$T$22,0))","v":"00:00:23.835"},"00:01:12.170",{"$f":"POWER((10*H:H/I:I),3)","v":36.024211578243737},{"$f":"IF(I444 < INDEX('Met25'!$B$23:$T$39,MATCH(F444,'Met25'!$A$23:$A$39, 0),MATCH(\"50 skrið\",'Met25'!$B$22:$T$22,0)), \"X\", \"\")","v":""}]
[null,"Riðill #4",null,"Aldur",null,null,"Besti tími","Viðmið","Loka Tími","Stig","Met"]
[null,2,{"$f":"VLOOKUP(37,Keppendur!B6:C1000,2,FALSE)","v":"Ingólfur M Bjarnason"},{"$f":"VLOOKUP(37,Keppendur!B6:D1000,3,FALSE)","v":15},{"$f":"VLOOKUP(37,Keppendur!B6:E1000,4,FALSE)","v":"NES                           "},{"$f":"CONCATENATE(\"S\",INDEX(Keppendur!F6:H1000,MATCH(37,Keppendur!B6:B1000,0),MATCH(\"S\",Keppendur!F5:H5,0)))","v":"S10"},"00:00:36",{"$f":"INDEX(Viðmið!$B$23:$T$39,MATCH(F446,Viðmið!$A$23:$A$39, 0),MATCH(\"50 skrið\",Viðmið!$B$22:$T$22,0))","v":"00:00:23.160"},"00:00:41.880",{"$f":"POWER((10*H:H/I:I),3)","v":169.12026331456292},{"$f":"IF(I446 < INDEX('Met25'!$B$23:$T$39,MATCH(F446,'Met25'!$A$23:$A$39, 0),MATCH(\"50 skrið\",'Met25'!$B$22:$T$22,0)), \"X\", \"\")","v":""}]
[null,3,{"$f":"VLOOKUP(40,Keppendur!B6:C1000,2,FALSE)","v":"Már Gunnarsson"},{"$f":"VLOOKUP(40,Keppendur!B6:D1000,3,FALSE)","v":16},{"$f":"VLOOKUP(40,Keppendur!B6:E1000,4,FALSE)","v":"NES                           "},{"$f":"CONCATENATE(\"S\",INDEX(Keppendur!F6:H1000,MATCH(40,Keppendur!B6:B1000,0),MATCH(\"S\",Keppendur!F5:H5,0)))","v":"S12"},"00:00:31",{"$f":"INDEX(Viðmið!$B$23:$T$39,MATCH(F447,Viðmið!$A$23:$A$39, 0),MATCH(\"50 skrið\",Viðmið!$B$22:$T$22,0))","v":"00:00:23.360"},"00:00:31.940",{"$f":"POWER((10*H:H/I:I),3)","v":391.21345216786546},{"$f":"IF(I447 < INDEX('Met25'!$B$23:$T$39,MATCH(F447,'Met25'!$A$23:$A$39, 0),MATCH(\"50 skrið\",'Met25'!$B$22:$T$22,0)), \"X\", \"\")","v":""}]
[null,4,{"$f":"VLOOKUP(3,Keppendur!B6:C1000,2,FALSE)","v":"Róbert Í Jónsson"},{"$f":"VLOOKUP(3,Keppendur!B6:D1000,3,FALSE)","v":14},{"$f":"VLOOKUP(3,Keppendur!B6:E1000,4,FALSE)","v":"Íþróttafélagið Fjörður        "},{"$f":"CONCATENATE(\"S\",INDEX(Keppendur!F6:H1000,MATCH(3,Keppendur!B6:B1000,0),MATCH(\"S\",Keppendur!F5:H5,0)))","v":"S14"},"00:00:28.480",{"$f":"INDEX(Viðmið!$B$23:$T$39,MATCH(F448,Viðmið!$A$23:$A$39, 0),MATCH(\"50 skrið\",Viðmið!$B$22:$T$22,0))","v":"00:00:23.835"},"00:00:28.750",{"$f":"POWER((10*H:H/I:I),3)","v":569.83753606977689},{"$f":"IF(I448 < INDEX('Met25'!$B$23:$T$39,MATCH(F448,'Met25'!$A$23:$A$39, 0),MATCH(\"50 skrið\",'Met25'!$B$22:$T$22,0)), \"X\", \"\")","v":""}]
[null,5,{"$f":"VLOOKUP(15,Keppendur!B6:C1000,2,FALSE)","v":"Björn  Axel Agnarsson"},{"$f":"VLOOKUP(15,Keppendur!B6:D1000,3,FALSE)","v":13},{"$f":"VLOOKUP(15,Keppendur!B6:E1000,4,FALSE)","v":"ÍFR                           "},{"$f":"CONCATENATE(\"S\",INDEX(Keppendur!F6:H1000,MATCH(15,Keppendur!B6:B1000,0),MATCH(\"S\",Keppendur!F5:H5,0)))","v":"S20"},"00:00:30.520",{"$f":"INDEX(Viðmið!$B$23:$T$39,MATCH(F449,Viðmið!$A$23:$A$39, 0),MATCH(\"50 skrið\",Viðmið!$B$22:$T$22,0))","v":"00:00:20.910"},"00:00:29.720",{"$f":"POWER((10*H:H/I:I),3)","v":348.26969308268224},{"$f":"IF(I449 < INDEX('Met25'!$B$23:$T$39,MATCH(F449,'Met25'!$A$23:$A$39, 0),MATCH(\"50 skrið\",'Met25'!$B$22:$T$22,0)), \"X\", \"\")","v":""}]
[null,6,{"$f":"VLOOKUP(58,Keppendur!B6:C1000,2,FALSE)","v":"Fannar Logi Jóhannesson"},{"$f":"VLOOKUP(58,Keppendur!B6:D1000,3,FALSE)","v":15},{"$f":"VLOOKUP(58,Keppendur!B6:E1000,4,FALSE)","v":"Sundfélagið Óðinn             "},{"$f":"CONCATENATE(\"S\",INDEX(Keppendur!F6:H1000,MATCH(58,Keppendur!B6:B1000,0),MATCH(\"S\",Keppendur!F5:H5,0)))","v":"S14"},"00:00:35.840",{"$f":"INDEX(Viðmið!$B$23:$T$39,MATCH(F450,Viðmið!$A$23:$A$39, 0),MATCH(\"50 skrið\",Viðmið!$B$22:$T$22,0))","v":"00:00:23.835"},"00:00:36.130",{"$f":"POWER((10*H:H/I:I),3)","v":287.11819550657344},{"$f":"IF(I450 < INDEX('Met25'!$B$23:$T$39,MATCH(F450,'Met25'!$A$23:$A$39, 0),MATCH(\"50 skrið\",'Met25'!$B$22:$T$22,0)), \"X\", \"\")","v":""}]
[null,7,{"$f":"VLOOKUP(39,Keppendur!B6:C1000,2,FALSE)","v":"Alexander Guðmundsson"},{"$f":"VLOOKUP(39,Keppendur!B6:D1000,3,FALSE)","v":12},{"$f":"VLOOKUP(39,Keppendur!B6:E1000,4,FALSE)","v":"NES                           "},{"$f":"CONCATENATE(\"S\",INDEX(Keppendur!F6:H1000,MATCH(39,Keppendur!B6:B1000,0),MATCH(\"S\",Keppendur!F5:H5,0)))","v":"S14"},"00:00:37",{"$f":"INDEX(Viðmið!$B$23:$T$39,MATCH(F451,Viðmið!$A$23:$A$39, 0),MATCH(\"50 skrið\",Viðmið!$B$22:$T$22,0))","v":"00:00:23.835"},"00:00:43.220",{"$f":"POWER((10*H:H/I:I),3)","v":167.729832362271},{"$f":"IF(I451 < INDEX('Met25'!$B$23:$T$39,MATCH(F451,'Met25'!$A$23:$A$39, 0),MATCH(\"50 skrið\",'Met25'!$B$22:$T$22,0)), \"X\", \"\")","v":""}]
[null,8,{"$f":"VLOOKUP(1,Keppendur!B6:C1000,2,FALSE)","v":"Hallgrímur A Heimisson"},{"$f":"VLOOKUP(1,Keppendur!B6:D1000,3,FALSE)","v":14},{"$f":"VLOOKUP(1,Keppendur!B6:E1000,4,FALSE)","v":"Íþróttafélagið Fjörður        "},{"$f":"CONCATENATE(\"S\",INDEX(Keppendur!F6:H1000,MATCH(1,Keppendur!B6:B1000,0),MATCH(\"S\",Keppendur!F5:H5,0)))","v":"S14"},"00:00:47.530",{"$f":"INDEX(Viðmið!$B$23:$T$39,MATCH(F452,Viðmið!$A$23:$A$39, 0),MATCH(\"50 skrið\",Viðmið!$B$22:$T$22,0))","v":"00:00:23.835"}]
[]
[]
[]
[]
[]
[]
[]
[]
[]
[]
[]
[]
[]
[]
[]
[]
[]
[]
[]
[]
[]
[]
[]
[]
[]
[]
[]
[]
[]
[]
[]
[]
[]
[]
[]
[]
[]
[]
[]
[]
[]
[]
[]
[]
[null,"8. Grein: Stúlkur 50m Skriðsund"]
[]
[null,0,{"$f":"VLOOKUP(41,Keppendur!B6:C1000,2,FALSE)","v":"Ingibjörg F Margeirsdóttir"},{"$f":"VLOOKUP(41,Keppendur!B6:D1000,3,FALSE)","v":16},{"$f":"VLOOKUP(41,Keppendur!B6:E1000,4,FALSE)","v":"NES                           "},{"$f":"CONCATENATE(\"S\",INDEX(Keppendur!F6:H1000,MATCH(41,Keppendur!B6:B1000,0),MATCH(\"S\",Keppendur!F5:H5,0)))","v":"S14"},"00:00:36",{"$f":"INDEX(Viðmið!$B$3:$T$19,MATCH(F499,Viðmið!$A$3:$A$19, 0),MATCH(\"50 skrið\",Viðmið!$B$2:$T$2,0))","v":"00:00:26.250"}]
[null,"Riðill #1",null,"Aldur",null,null,"Besti tími","Viðmið","Loka Tími","Stig","Met"]
[null,4,{"$f":"VLOOKUP(57,Keppendur!B6:C1000,2,FALSE)","v":"Arndís Atladóttir"},{"$f":"VLOOKUP(57,Keppendur!B6:D1000,3,FALSE)","v":15},{"$f":"VLOOKUP(57,Keppendur!B6:E1000,4,FALSE)","v":"Sundfélagið Óðinn             "},{"$f":"CONCATENATE(\"S\",INDEX(Keppendur!F6:H1000,MATCH(57,Keppendur!B6:B1000,0),MATCH(\"S\",Keppendur!F5:H5,0)))","v":"S14"},"00:01:27.880",{"$f":"INDEX(Viðmið!$B$3:$T$19,MATCH(F501,Viðmið!$A$3:$A$19, 0),MATCH(\"50 skrið\",Viðmið!$B$2:$T$2,0))","v":"00:00:26.250"},"00:01:10.840",{"$f":"POWER((10*H:H/I:I),3)","v":50.883198944518284},{"$f":"IF(I501 < INDEX('Met25'!$B$3:$T$19,MATCH(F501,'Met25'!$A$3:$A$19, 0),MATCH(\"50 skrið\",'Met25'!$B$2:$T$2,0)), \"X\", \"\")","v":""}]
[null,5,{"$f":"VLOOKUP(10,Keppendur!B6:C1000,2,FALSE)","v":"Kristjana L Albertsdóttir"},{"$f":"VLOOKUP(10,Keppendur!B6:D1000,3,FALSE)","v":0},{"$f":"VLOOKUP(10,Keppendur!B6:E1000,4,FALSE)","v":"Íþróttafélagið Fjörður        "},{"$f":"CONCATENATE(\"S\",INDEX(Keppendur!F6:H1000,MATCH(10,Keppendur!B6:B1000,0),MATCH(\"S\",Keppendur!F5:H5,0)))","v":"S14"},"00:01:57.270",{"$f":"INDEX(Viðmið!$B$3:$T$19,MATCH(F502,Viðmið!$A$3:$A$19, 0),MATCH(\"50 skrið\",Viðmið!$B$2:$T$2,0))","v":"00:00:26.250"},"00:01:57.770",{"$f":"POWER((10*H:H/I:I),3)","v":11.074038761010952},{"$f":"IF(I502 < INDEX('Met25'!$B$3:$T$19,MATCH(F502,'Met25'!$A$3:$A$19, 0),MATCH(\"50 skrið\",'Met25'!$B$2:$T$2,0)), \"X\", \"\")","v":""}]
[null,"Riðill #2",null,"Aldur",null,null,"Besti tími","Viðmið","Loka Tími","Stig","Met"]
[null,1,{"$f":"VLOOKUP(14,Keppendur!B6:C1000,2,FALSE)","v":"Guðbjörg S Sigfúsdóttir"},{"$f":"VLOOKUP(14,Keppendur!B6:D1000,3,FALSE)","v":15},{"$f":"VLOOKUP(14,Keppendur!B6:E1000,4,FALSE)","v":"Íþróttafélagið Fjörður        "},{"$f":"CONCATENATE(\"S\",INDEX(Keppendur!F6:H1000,MATCH(14,Keppendur!B6:B1000,0),MATCH(\"S\",Keppendur!F5:H5,0)))","v":"S14"},"00:01:20.230",{"$f":"INDEX(Viðmið!$B$3:$T$19,MATCH(F504,Viðmið!$A$3:$A$19, 0),MATCH(\"50 skrið\",Viðmið!$B$2:$T$2,0))","v":"00:00:26.250"}]
[null,2,{"$f":"VLOOKUP(11,Keppendur!B6:C1000,2,FALSE)","v":"Victoria L Karenardóttir"},{"$f":"VLOOKUP(11,Keppendur!B6:D1000,3,FALSE)","v":0},{"$f":"VLOOKUP(11,Keppendur!B6:E1000,4,FALSE)","v":"Íþróttafélagið Fjörður        "},{"$f":"CONCATENATE(\"S\",INDEX(Keppendur!F6:H1000,MATCH(11,Keppendur!B6:B1000,0),MATCH(\"S\",Keppendur!F5:H5,0)))","v":"S14"},"00:01:10.330",{"$f":"INDEX(Viðmið!$B$3:$T$19,MATCH(F505,Viðmið!$A$3:$A$19, 0),MATCH(\"50 skrið\",Viðmið!$B$2:$T$2,0))","v":"00:00:26.250"}]
[null,3,{"$f":"VLOOKUP(26,Keppendur!B6:C1000,2,FALSE)","v":"Heiður B Egilsdóttir"},{"$f":"VLOOKUP(26,Keppendur!B6:D1000,3,FALSE)","v":11},{"$f":"VLOOKUP(26,Keppendur!B6:E1000,4,FALSE)","v":"ÍFR                           "},{"$f":"CONCATENATE(\"S\",INDEX(Keppendur!F6:H1000,MATCH(26,Keppendur!B6:B1000,0),MATCH(\"S\",Keppendur!F5:H5,0)))","v":"S8"},"00:00:58.800",{"$f":"INDEX(Viðmið!$B$3:$T$19,MATCH(F506,Viðmið!$A$3:$A$19, 0),MATCH(\"50 skrið\",Viðmið!$B$2:$T$2,0))","v":"00:00:30.130"},"00:00:53.550",{"$f":"1000*POWER((H:H/I:I),2.8)","v":199.83476228233144},{"$f":"IF(I506 < INDEX('Met25'!$B$3:$T$19,MATCH(F506,'Met25'!$A$3:$A$19, 0),MATCH(\"50 skrið\",'Met25'!$B$2:$T$2,0)), \"X\", \"\")","v":""}]
[null,4,{"$f":"VLOOKUP(5,Keppendur!B6:C1000,2,FALSE)","v":"Anna R Þrastardóttir"},{"$f":"VLOOKUP(5,Keppendur!B6:D1000,3,FALSE)","v":10},{"$f":"VLOOKUP(5,Keppendur!B6:E1000,4,FALSE)","v":"Íþróttafélagið Fjörður        "},{"$f":"CONCATENATE(\"S\",INDEX(Keppendur!F6:H1000,MATCH(5,Keppendur!B6:B1000,0),MATCH(\"S\",Keppendur!F5:H5,0)))","v":"S14"},"00:00:52.590",{"$f":"INDEX(Viðmið!$B$3:$T$19,MATCH(F507,Viðmið!$A$3:$A$19, 0),MATCH(\"50 skrið\",Viðmið!$B$2:$T$2,0))","v":"00:00:26.250"},"00:00:54.180",{"$f":"POWER((10*H:H/I:I),3)","v":113.73471988945828},{"$f":"IF(I507 < INDEX('Met25'!$B$3:$T$19,MATCH(F507,'Met25'!$A$3:$A$19, 0),MATCH(\"50 skrið\",'Met25'!$B$2:$T$2,0)), \"X\", \"\")","v":""}]
[null,5,{"$f":"VLOOKUP(8,Keppendur!B6:C1000,2,FALSE)","v":"Katrín E Kristjánsdóttir"},{"$f":"VLOOKUP(8,Keppendur!B6:D1000,3,FALSE)","v":11},{"$f":"VLOOKUP(8,Keppendur!B6:E1000,4,FALSE)","v":"Íþróttafélagið Fjörður        "},{"$f":"CONCATENATE(\"S\",INDEX(Keppendur!F6:H1000,MATCH(8,Keppendur!B6:B1000,0),MATCH(\"S\",Keppendur!F5:H5,0)))","v":"S14"},"00:00:54.590",{"$f":"INDEX(Viðmið!$B$3:$T$19,MATCH(F508,Viðmið!$A$3:$A$19, 0),MATCH(\"50 skrið\",Viðmið!$B$2:$T$2,0))","v":"00:00:26.250"},"00:00:58.730",{"$f":"POWER((10*H:H/I:I),3)","v":89.295600444803497},{"$f":"IF(I508 < INDEX('Met25'!$B$3:$T$19,MATCH(F508,'Met25'!$A$3:$A$19, 0),MATCH(\"50 skrið\",'Met25'!$B$2:$T$2,0)), \"X\", \"\")","v":""}]
[null,6,{"$f":"VLOOKUP(6,Keppendur!B6:C1000,2,FALSE)","v":"Nevena Cupovic"},{"$f":"VLOOKUP(6,Keppendur!B6:D1000,3,FALSE)","v":15},{"$f":"VLOOKUP(6,Keppendur!B6:E1000,4,FALSE)","v":"Íþróttafélagið Fjörður        "},{"$f":"CONCATENATE(\"S\",INDEX(Keppendur!F6:H1000,MATCH(6,Keppendur!B6:B1000,0),MATCH(\"S\",Keppendur!F5:H5,0)))","v":"S14"},"00:01:09.460",{"$f":"INDEX(Viðmið!$B$3:$T$19,MATCH(F509,Viðmið!$A$3:$A$19, 0),MATCH(\"50 skrið\",Viðmið!$B$2:$T$2,0))","v":"00:00:26.250"}]
[null,7,{"$f":"VLOOKUP(13,Keppendur!B6:C1000,2,FALSE)","v":"Emelía Ý Gunnarsdóttir"},{"$f":"VLOOKUP(13,Keppendur!B6:D1000,3,FALSE)","v":9},{"$f":"VLOOKUP(13,Keppendur!B6:E1000,4,FALSE)","v":"Íþróttafélagið Fjörður        "},{"$f":"CONCATENATE(\"S\",INDEX(Keppendur!F6:H1000,MATCH(13,Keppendur!B6:B1000,0),MATCH(\"S\",Keppendur!F5:H5,0)))","v":"S14"},"00:01:20.160",{"$f":"INDEX(Viðmið!$B$3:$T$19,MATCH(F510,Viðmið!$A$3:$A$19, 0),MATCH(\"50 skrið\",Viðmið!$B$2:$T$2,0))","v":"00:00:26.250"},"DQ"]
[null,8,{"$f":"VLOOKUP(12,Keppendur!B6:C1000,2,FALSE)","v":"Sigrún Kjartansdóttir"},{"$f":"VLOOKUP(12,Keppendur!B6:D1000,3,FALSE)","v":0},{"$f":"VLOOKUP(12,Keppendur!B6:E1000,4,FALSE)","v":"Íþróttafélagið Fjörður        "},{"$f":"CONCATENATE(\"S\",INDEX(Keppendur!F6:H1000,MATCH(12,Keppendur!B6:B1000,0),MATCH(\"S\",Keppendur!F5:H5,0)))","v":"S14"},"00:01:21.370",{"$f":"INDEX(Viðmið!$B$3:$T$19,MATCH(F511,Viðmið!$A$3:$A$19, 0),MATCH(\"50 skrið\",Viðmið!$B$2:$T$2,0))","v":"00:00:26.250"},"00:01:11.400",{"$f":"POWER((10*H:H/I:I),3)","v":49.695312864803839},{"$f":"IF(I511 < INDEX('Met25'!$B$3:$T$19,MATCH(F511,'Met25'!$A$3:$A$19, 0),MATCH(\"50 skrið\",'Met25'!$B$2:$T$2,0)), \"X\", \"\")","v":""}]
[null,"Riðill #3",null,"Aldur",null,null,"Besti tími","Viðmið","Loka Tími","Stig","Met"]
[null,1,{"$f":"VLOOKUP(59,Keppendur!B6:C1000,2,FALSE)","v":"Tinna Rut Andrésdóttir"},{"$f":"VLOOKUP(59,Keppendur!B6:D1000,3,FALSE)","v":16},{"$f":"VLOOKUP(59,Keppendur!B6:E1000,4,FALSE)","v":"Sundfélagið Óðinn             "},{"$f":"CONCATENATE(\"S\",INDEX(Keppendur!F6:H1000,MATCH(59,Keppendur!B6:B1000,0),MATCH(\"S\",Keppendur!F5:H5,0)))","v":"S14"},"00:00:43.160",{"$f":"INDEX(Viðmið!$B$3:$T$19,MATCH(F513,Viðmið!$A$3:$A$19, 0),MATCH(\"50 skrið\",Viðmið!$B$2:$T$2,0))","v":"00:00:26.250"},"00:00:41.630",{"$f":"POWER((10*H:H/I:I),3)","v":250.72106955079775},{"$f":"IF(I513 < INDEX('Met25'!$B$3:$T$19,MATCH(F513,'Met25'!$A$3:$A$19, 0),MATCH(\"50 skrið\",'Met25'!$B$2:$T$2,0)), \"X\", \"\")","v":""}]
[null,2,{"$f":"VLOOKUP(67,Keppendur!B6:C1000,2,FALSE)","v":"Sandra S Gunnarsdóttir"},{"$f":"VLOOKUP(67,Keppendur!B6:D1000,3,FALSE)","v":16},{"$f":"VLOOKUP(67,Keppendur!B6:E1000,4,FALSE)","v":"Sunddeild Fjölnis             "},{"$f":"CONCATENATE(\"S\",INDEX(Keppendur!F6:H1000,MATCH(67,Keppendur!B6:B1000,0),MATCH(\"S\",Keppendur!F5:H5,0)))","v":"S12"},"00:00:36.020",{"$f":"INDEX(Viðmið!$B$3:$T$19,MATCH(F514,Viðmið!$A$3:$A$19, 0),MATCH(\"50 skrið\",Viðmið!$B$2:$T$2,0))","v":"00:00:26.900"},"00:00:37.310",{"$f":"POWER((10*H:H/I:I),3)","v":374.78404388257479},{"$f":"IF(I514 < INDEX('Met25'!$B$3:$T$19,MATCH(F514,'Met25'!$A$3:$A$19, 0),MATCH(\"50 skrið\",'Met25'!$B$2:$T$2,0)), \"X\", \"\")","v":""}]
[null,3,{"$f":"VLOOKUP(36,Keppendur!B6:C1000,2,FALSE)","v":"Ástrós M Bjarnadóttir"},{"$f":"VLOOKUP(36,Keppendur!B6:D1000,3,FALSE)","v":16},{"$f":"VLOOKUP(36,Keppendur!B6:E1000,4,FALSE)","v":"NES                           "},{"$f":"CONCATENATE(\"S\",INDEX(Keppendur!F6:H1000,MATCH(36,Keppendur!B6:B1000,0),MATCH(\"S\",Keppendur!F5:H5,0)))","v":"S18"},"00:00:35",{"$f":"INDEX(Viðmið!$B$3:$T$19,MATCH(F515,Viðmið!$A$3:$A$19, 0),MATCH(\"50 skrið\",Viðmið!$B$2:$T$2,0))","v":"00:00:26.150"},"00:00:37.400",{"$f":"POWER((10*H:H/I:I),3)","v":341.82220629562948},{"$f":"IF(I515 < INDEX('Met25'!$B$3:$T$19,MATCH(F515,'Met25'!$A$3:$A$19, 0),MATCH(\"50 skrið\",'Met25'!$B$2:$T$2,0)), \"X\", \"\")","v":""}]
[null,4,{"$f":"VLOOKUP(32,Keppendur!B6:C1000,2,FALSE)","v":"Gunnhildur Brynja Be"},{"$f":"VLOOKUP(32,Keppendur!B6:D1000,3,FALSE)","v":14},{"$f":"VLOOKUP(32,Keppendur!B6:E1000,4,FALSE)","v":"Íþróttafélagið Ösp            "},{"$f":"CONCATENATE(\"S\",INDEX(Keppendur!F6:H1000,MATCH(32,Keppendur!B6:B1000,0),MATCH(\"S\",Keppendur!F5:H5,0)))","v":"S14"},"00:00:30.820",{"$f":"INDEX(Viðmið!$B$3:$T$19,MATCH(F516,Viðmið!$A$3:$A$19, 0),MATCH(\"50 skrið\",Viðmið!$B$2:$T$2,0))","v":"00:00:26.250"},"00:00:48.320",{"$f":"POWER((10*H:H/I:I),3)","v":160.33535127239045},{"$f":"IF(I516 < INDEX('Met25'!$B$3:$T$19,MATCH(F516,'Met25'!$A$3:$A$19, 0),MATCH(\"50 skrið\",'Met25'!$B$2:$T$2,0)), \"X\", \"\")","v":""}]
[null,5,{"$f":"VLOOKUP(20,Keppendur!B6:C1000,2,FALSE)","v":"Thórey Í Magnúsdóttir"},{"$f":"VLOOKUP(20,Keppendur!B6:D1000,3,FALSE)","v":16},{"$f":"VLOOKUP(20,Keppendur!B6:E1000,4,FALSE)","v":"ÍFR                           "},{"$f":"CONCATENATE(\"S\",INDEX(Keppendur!F6:H1000,MATCH(20,Keppendur!B6:B1000,0),MATCH(\"S\",Keppendur!F5:H5,0)))","v":"S14"},"00:00:32.120",{"$f":"INDEX(Viðmið!$B$3:$T$19,MATCH(F517,Viðmið!$A$3:$A$19, 0),MATCH(\"50 skrið\",Viðmið!$B$2:$T$2,0))","v":"00:00:26.250"},"00:00:32.480",{"$f":"POWER((10*H:H/I:I),3)","v":527.91256967385232},{"$f":"IF(I517 < INDEX('Met25'!$B$3:$T$19,MATCH(F517,'Met25'!$A$3:$A$19, 0),MATCH(\"50 skrið\",'Met25'!$B$2:$T$2,0)), \"X\", \"\")","v":""}]
[null,6,{"$f":"VLOOKUP(84,Keppendur!B6:C1000,2,FALSE)","v":"Birta Bjarnadóttir"},{"$f":"VLOOKUP(84,Keppendur!B6:D1000,3,FALSE)","v":12},{"$f":"VLOOKUP(84,Keppendur!B6:E1000,4,FALSE)","v":"NES                           "},{"$f":"CONCATENATE(\"S\",INDEX(Keppendur!F6:H1000,MATCH(84,Keppendur!B6:B1000,0),MATCH(\"S\",Keppendur!F5:H5,0)))","v":"S14"},"00:00:51",{"$f":"INDEX(Viðmið!$B$3:$T$19,MATCH(F518,Viðmið!$A$3:$A$19, 0),MATCH(\"50 skrið\",Viðmið!$B$2:$T$2,0))","v":"00:00:26.250"},"00:00:52.160",{"$f":"POWER((10*H:H/I:I),3)","v":127.46686841753355},{"$f":"IF(I518 < INDEX('Met25'!$B$3:$T$19,MATCH(F518,'Met25'!$A$3:$A$19, 0),MATCH(\"50 skrið\",'Met25'!$B$2:$T$2,0)), \"X\", \"\")","v":""}]
[null,7,{"$f":"VLOOKUP(7,Keppendur!B6:C1000,2,FALSE)","v":"Sigríður Aníta Rögnvaldsóttir"},{"$f":"VLOOKUP(7,Keppendur!B6:D1000,3,FALSE)","v":13},{"$f":"VLOOKUP(7,Keppendur!B6:E1000,4,FALSE)","v":"Íþróttafélagið Fjörður        "},{"$f":"CONCATENATE(\"S\",INDEX(Keppendur!F6:H1000,MATCH(7,Keppendur!B6:B1000,0),MATCH(\"S\",Keppendur!F5:H5,0)))","v":"S14"},"00:00:39.600",{"$f":"INDEX(Viðmið!$B$3:$T$19,MATCH(F519,Viðmið!$A$3:$A$19, 0),MATCH(\"50 skrið\",Viðmið!$B$2:$T$2,0))","v":"00:00:26.250"}]
[null,8,{"$f":"VLOOKUP(43,Keppendur!B6:C1000,2,FALSE)","v":"Matthildur E Sigurðardóttir"},{"$f":"VLOOKUP(43,Keppendur!B6:D1000,3,FALSE)","v":10},{"$f":"VLOOKUP(43,Keppendur!B6:E1000,4,FALSE)","v":"NES                           "},{"$f":"CONCATENATE(\"S\",INDEX(Keppendur!F6:H1000,MATCH(43,Keppendur!B6:B1000,0),MATCH(\"S\",Keppendur!F5:H5,0)))","v":"S10"},"00:00:46",{"$f":"INDEX(Viðmið!$B$3:$T$19,MATCH(F520,Viðmið!$A$3:$A$19, 0),MATCH(\"50 skrið\",Viðmið!$B$2:$T$2,0))","v":"00:00:27.780"}]
[]
[]
[]
[]
[]
[]
[]
[]
[]
[]
[]
[]
[]
[]
[]
[]
[]
[]
[]
[]
[]
[]
[]
[]
[]
[]
[]
[]
[]
[]
[]
[]
[]
[]
[]
[]
[]
[]
[]
[]
[]
[]
[]
[]
[]
[]
[null,"9. Grein: Drengir 50m Flugsund"]
[]
[null,0,{"$f":"VLOOKUP(42,Keppendur!B6:C1000,2,FALSE)","v":"Róbert Salvar Reynisson"},{"$f":"VLOOKUP(42,Keppendur!B6:D1000,3,FALSE)","v":16},{"$f":"VLOOKUP(42,Keppendur!B6:E1000,4,FALSE)","v":"NES                           "},{"$f":"CONCATENATE(\"S\",INDEX(Keppendur!F6:H1000,MATCH(42,Keppendur!B6:B1000,0),MATCH(\"S\",Keppendur!F5:H5,0)))","v":"S9"},"00:00:47",{"$f":"INDEX(Viðmið!$B$23:$T$39,MATCH(F569,Viðmið!$A$23:$A$39, 0),MATCH(\"50 flug\",Viðmið!$B$22:$T$22,0))","v":"00:00:26.523"}]
[null,"Riðill #1",null,"Aldur",null,null,"Besti tími","Viðmið","Loka Tími","Stig","Met"]
[null,2,{"$f":"VLOOKUP(39,Keppendur!B6:C1000,2,FALSE)","v":"Alexander Guðmundsson"},{"$f":"VLOOKUP(39,Keppendur!B6:D1000,3,FALSE)","v":12},{"$f":"VLOOKUP(39,Keppendur!B6:E1000,4,FALSE)","v":"NES                           "},{"$f":"CONCATENATE(\"S\",INDEX(Keppendur!F6:H1000,MATCH(39,Keppendur!B6:B1000,0),MATCH(\"S\",Keppendur!F5:H5,0)))","v":"S14"},"00:00:45",{"$f":"INDEX(Viðmið!$B$23:$T$39,MATCH(F571,Viðmið!$A$23:$A$39, 0),MATCH(\"50 flug\",Viðmið!$B$22:$T$22,0))","v":"00:00:25.662"}]
[null,3,{"$f":"VLOOKUP(40,Keppendur!B6:C1000,2,FALSE)","v":"Már Gunnarsson"},{"$f":"VLOOKUP(40,Keppendur!B6:D1000,3,FALSE)","v":16},{"$f":"VLOOKUP(40,Keppendur!B6:E1000,4,FALSE)","v":"NES                           "},{"$f":"CONCATENATE(\"S\",INDEX(Keppendur!F6:H1000,MATCH(40,Keppendur!B6:B1000,0),MATCH(\"S\",Keppendur!F5:H5,0)))","v":"S12"},"00:00:36",{"$f":"INDEX(Viðmið!$B$23:$T$39,MATCH(F572,Viðmið!$A$23:$A$39, 0),MATCH(\"50 flug\",Viðmið!$B$22:$T$22,0))","v":"00:00:25.591"},"00:00:35.270",{"$f":"POWER((10*H:H/I:I),3)","v":381.96404151615468},{"$f":"IF(I572 < INDEX('Met25'!$B$23:$T$39,MATCH(F572,'Met25'!$A$23:$A$39, 0),MATCH(\"50 flug\",'Met25'!$B$22:$T$22,0)), \"X\", \"\")","v":""}]
[null,4,{"$f":"VLOOKUP(15,Keppendur!B6:C1000,2,FALSE)","v":"Björn  Axel Agnarsson"},{"$f":"VLOOKUP(15,Keppendur!B6:D1000,3,FALSE)","v":13},{"$f":"VLOOKUP(15,Keppendur!B6:E1000,4,FALSE)","v":"ÍFR                           "},{"$f":"CONCATENATE(\"S\",INDEX(Keppendur!F6:H1000,MATCH(15,Keppendur!B6:B1000,0),MATCH(\"S\",Keppendur!F5:H5,0)))","v":"S20"},"00:00:30.340",{"$f":"INDEX(Viðmið!$B$23:$T$39,MATCH(F573,Viðmið!$A$23:$A$39, 0),MATCH(\"50 flug\",Viðmið!$B$22:$T$22,0))","v":"00:00:22.430"},"00:00:31.080",{"$f":"POWER((10*H:H/I:I),3)","v":375.87616775953461},{"$f":"IF(I573 < INDEX('Met25'!$B$23:$T$39,MATCH(F573,'Met25'!$A$23:$A$39, 0),MATCH(\"50 flug\",'Met25'!$B$22:$T$22,0)), \"X\", \"\")","v":""}]
[null,5,{"$f":"VLOOKUP(3,Keppendur!B6:C1000,2,FALSE)","v":"Róbert Í Jónsson"},{"$f":"VLOOKUP(3,Keppendur!B6:D1000,3,FALSE)","v":14},{"$f":"VLOOKUP(3,Keppendur!B6:E1000,4,FALSE)","v":"Íþróttafélagið Fjörður        "},{"$f":"CONCATENATE(\"S\",INDEX(Keppendur!F6:H1000,MATCH(3,Keppendur!B6:B1000,0),MATCH(\"S\",Keppendur!F5:H5,0)))","v":"S14"},"00:00:31.290",{"$f":"INDEX(Viðmið!$B$23:$T$39,MATCH(F574,Viðmið!$A$23:$A$39, 0),MATCH(\"50 flug\",Viðmið!$B$22:$T$22,0))","v":"00:00:25.662"},"00:00:30.600",{"$f":"POWER((10*H:H/I:I),3)","v":589.78856466601883},{"$f":"IF(I574 < INDEX('Met25'!$B$23:$T$39,MATCH(F574,'Met25'!$A$23:$A$39, 0),MATCH(\"50 flug\",'Met25'!$B$22:$T$22,0)), \"X\", \"\")","v":""}]
[null,6,{"$f":"VLOOKUP(58,Keppendur!B6:C1000,2,FALSE)","v":"Fannar Logi Jóhannesson"},{"$f":"VLOOKUP(58,Keppendur!B6:D1000,3,FALSE)","v":15},{"$f":"VLOOKUP(58,Keppendur!B6:E1000,4,FALSE)","v":"Sundfélagið Óðinn             "},{"$f":"CONCATENATE(\"S\",INDEX(Keppendur!F6:H1000,MATCH(58,Keppendur!B6:B1000,0),MATCH(\"S\",Keppendur!F5:H5,0)))","v":"S14"},"00:00:42.080",{"$f":"INDEX(Viðmið!$B$23:$T$39,MATCH(F575,Viðmið!$A$23:$A$39, 0),MATCH(\"50 flug\",Viðmið!$B$22:$T$22,0))","v":"00:00:25.662"},"00:00:45.380",{"$f":"POWER((10*H:H/I:I),3)","v":180.82861360374301},{"$f":"IF(I575 < INDEX('Met25'!$B$23:$T$39,MATCH(F575,'Met25'!$A$23:$A$39, 0),MATCH(\"50 flug\",'Met25'!$B$22:$T$22,0)), \"X\", \"\")","v":""}]
[null,7,{"$f":"VLOOKUP(37,Keppendur!B6:C1000,2,FALSE)","v":"Ingólfur M Bjarnason"},{"$f":"VLOOKUP(37,Keppendur!B6:D1000,3,FALSE)","v":15},{"$f":"VLOOKUP(37,Keppendur!B6:E1000,4,FALSE)","v":"NES                           "},{"$f":"CONCATENATE(\"S\",INDEX(Keppendur!F6:H1000,MATCH(37,Keppendur!B6:B1000,0),MATCH(\"S\",Keppendur!F5:H5,0)))","v":"S10"},"00:00:47",{"$f":"INDEX(Viðmið!$B$23:$T$39,MATCH(F576,Viðmið!$A$23:$A$39, 0),MATCH(\"50 flug\",Viðmið!$B$22:$T$22,0))","v":"00:00:25.370"},"00:01:08.860",{"$f":"POWER((10*H:H/I:I),3)","v":50.010057880196989},{"$f":"IF(I576 < INDEX('Met25'!$B$23:$T$39,MATCH(F576,'Met25'!$A$23:$A$39, 0),MATCH(\"50 flug\",'Met25'!$B$22:$T$22,0)), \"X\", \"\")","v":""}]
[]
[]
[]
[]
[]
[]
[]
[]
[]
[]
[]
[]
[]
[]
[]
[]
[]
[]
[]
[]
[]
[]
[]
[]
[]
[]
[]
[]
[]
[]
[]
[]
[]
[]
[]
[]
[]
[]
[]
[]
[]
[]
[]
[]
[]
[]
[]
[]
[]
[]
[]
[]
[]
[]
[]
[]
[]
[]
[]
[]
[null,"10. Grein: Stúlkur 50m Flugsund"]
[]
[null,0,{"$f":"VLOOKUP(41,Keppendur!B6:C1000,2,FALSE)","v":"Ingibjörg F Margeirsdóttir"},{"$f":"VLOOKUP(41,Keppendur!B6:D1000,3,FALSE)","v":16},{"$f":"VLOOKUP(41,Keppendur!B6:E1000,4,FALSE)","v":"NES                           "},{"$f":"CONCATENATE(\"S\",INDEX(Keppendur!F6:H1000,MATCH(41,Keppendur!B6:B1000,0),MATCH(\"S\",Keppendur!F5:H5,0)))","v":"S14"},"00:00:41",{"$f":"INDEX(Viðmið!$B$3:$T$19,MATCH(F639,Viðmið!$A$3:$A$19, 0),MATCH(\"50 flug\",Viðmið!$B$2:$T$2,0))","v":"00:00:27.489"}]
[null,"Riðill #1",null,"Aldur",null,null,"Besti tími","Viðmið","Loka Tími","Stig","Met"]
[null,2,{"$f":"VLOOKUP(7,Keppendur!B6:C1000,2,FALSE)","v":"Sigríður Aníta Rögnvaldsóttir"},{"$f":"VLOOKUP(7,Keppendur!B6:D1000,3,FALSE)","v":13},{"$f":"VLOOKUP(7,Keppendur!B6:E1000,4,FALSE)","v":"Íþróttafélagið Fjörður        "},{"$f":"CONCATENATE(\"S\",INDEX(Keppendur!F6:H1000,MATCH(7,Keppendur!B6:B1000,0),MATCH(\"S\",Keppendur!F5:H5,0)))","v":"S14"},"00:00:55.200",{"$f":"INDEX(Viðmið!$B$3:$T$19,MATCH(F641,Viðmið!$A$3:$A$19, 0),MATCH(\"50 flug\",Viðmið!$B$2:$T$2,0))","v":"00:00:27.489"}]
[null,3,{"$f":"VLOOKUP(36,Keppendur!B6:C1000,2,FALSE)","v":"Ástrós M Bjarnadóttir"},{"$f":"VLOOKUP(36,Keppendur!B6:D1000,3,FALSE)","v":16},{"$f":"VLOOKUP(36,Keppendur!B6:E1000,4,FALSE)","v":"NES                           "},{"$f":"CONCATENATE(\"S\",INDEX(Keppendur!F6:H1000,MATCH(36,Keppendur!B6:B1000,0),MATCH(\"S\",Keppendur!F5:H5,0)))","v":"S18"},"00:00:42",{"$f":"INDEX(Viðmið!$B$3:$T$19,MATCH(F642,Viðmið!$A$3:$A$19, 0),MATCH(\"50 flug\",Viðmið!$B$2:$T$2,0))","v":"00:00:28.280"},"00:00:51.310",{"$f":"POWER((10*H:H/I:I),3)","v":167.42957367975893},{"$f":"IF(I642 < INDEX('Met25'!$B$3:$T$19,MATCH(F642,'Met25'!$A$3:$A$19, 0),MATCH(\"50 flug\",'Met25'!$B$2:$T$2,0)), \"X\", \"\")","v":""}]
[null,4,{"$f":"VLOOKUP(20,Keppendur!B6:C1000,2,FALSE)","v":"Thórey Í Magnúsdóttir"},{"$f":"VLOOKUP(20,Keppendur!B6:D1000,3,FALSE)","v":16},{"$f":"VLOOKUP(20,Keppendur!B6:E1000,4,FALSE)","v":"ÍFR                           "},{"$f":"CONCATENATE(\"S\",INDEX(Keppendur!F6:H1000,MATCH(20,Keppendur!B6:B1000,0),MATCH(\"S\",Keppendur!F5:H5,0)))","v":"S14"},"00:00:36.100",{"$f":"INDEX(Viðmið!$B$3:$T$19,MATCH(F643,Viðmið!$A$3:$A$19, 0),MATCH(\"50 flug\",Viðmið!$B$2:$T$2,0))","v":"00:00:27.489"},"00:00:37.350",{"$f":"POWER((10*H:H/I:I),3)","v":398.64797402307829},{"$f":"IF(I643 < INDEX('Met25'!$B$3:$T$19,MATCH(F643,'Met25'!$A$3:$A$19, 0),MATCH(\"50 flug\",'Met25'!$B$2:$T$2,0)), \"X\", \"\")","v":""}]
[null,6,{"$f":"VLOOKUP(67,Keppendur!B6:C1000,2,FALSE)","v":"Sandra S Gunnarsdóttir"},{"$f":"VLOOKUP(67,Keppendur!B6:D1000,3,FALSE)","v":16},{"$f":"VLOOKUP(67,Keppendur!B6:E1000,4,FALSE)","v":"Sunddeild Fjölnis             "},{"$f":"CONCATENATE(\"S\",INDEX(Keppendur!F6:H1000,MATCH(67,Keppendur!B6:B1000,0),MATCH(\"S\",Keppendur!F5:H5,0)))","v":"S12"},"00:00:42.210",{"$f":"INDEX(Viðmið!$B$3:$T$19,MATCH(F644,Viðmið!$A$3:$A$19, 0),MATCH(\"50 flug\",Viðmið!$B$2:$T$2,0))","v":"00:00:28.158"},"00:00:44.610",{"$f":"POWER((10*H:H/I:I),3)","v":251.47573548164664},{"$f":"IF(I644 < INDEX('Met25'!$B$3:$T$19,MATCH(F644,'Met25'!$A$3:$A$19, 0),MATCH(\"50 flug\",'Met25'!$B$2:$T$2,0)), \"X\", \"\")","v":""}]
[]
[]
[]
[]
[]
[]
[]
[]
[]
[]
[]
[]
[]
[]
[]
[]
[]
[]
[]
[]
[]
[]
[]
[]
[]
[]
[]
[]
[]
[]
[]
[]
[]
[]
[]
[]
[]
[]
[]
[]
[]
[]
[]
[]
[]
[]
[]
[]
[]
[]
[]
[]
[]
[]
[]
[]
[]
[]
[]
[]
[]
[]
[]
[]
[]
[]
[]
[]
[]
[]
[]
[]
[]
[]
[]
[]
[]
[]
[]
[]
[]
[]
[]
[]
[]
[]
[]
[]
[]
[]
[]
[]
[]
[]
[]
[]
[]
[]
[]
[]
[]
[]
[]
[]
[]
[]
[]
[]
[]
[]
[]
[]
[]
[]
[]
[]
[]
[]
[]
[]
[]
[]
[]
[]
[]
[]
[]
[]
[]
[]
[]
[]
[]
[]
[]
[]
[]
[]
[]
[]
[]
[]
[]
[]
[]
[]
[]
[]
[]
[]
[]
[]
[]
[]
[]
[]
[]
[]
[]
[]
[]
[]
[]
[]
[]
[]
[]
[]
[]
[]
[]
[]
[]
[]
[]
[]
[]
[]
[]
[]
[]
[]
[]
[]
[]
[]
[]
[]
[]
[]
[]
[]
[]
[]
[]
[]
[]
[]
[]
[]
[]
[]
[]
[]
[]
[]
[]
[]
[]
[]
[]
[]
[]
[]
[]
[]
[]
[]
[]
[]
[]
[]
[]
[]
[]
[]
[]
[]
[]
[]
[]
[]
[]
[]
[]
[]
[]
[]
[]
[]
[]
[]
[]
[]
[]
[]
[]
[]
[]
[]
[]
[]
[]
[]
[]
[]
[]
[]
[]
[]
[]
[]
[]
[]
[]
[]
[]
[]
[]
[]
[]
[]
[]
[]
[]
[]
[]
[]
[]
[]
[]
[]
[]
[]
[]
[]
[]
[]
[]
[]
[]
[]
[]
[]
[]
[]
[]
[]
[]
[]
[]
[]
[]
[]
[]
[]
[]
[]
[]
[]
[]
[]
[]
[]
[]
[]
[]
[]
[]
[]
[]
[]
[]
[]
[]
[]
[]
[]
[]
[]
[]
[]
[]
[]
[]
[]
[]
[]
[]
[]
[]
[]
[]
[]
[]
[]
[]
[]
[]
[]
[]
[]
[]
[]
[]
[]
[]
[]
[]
[]
[]
[]
[]
[]
[]
[]
[]
[]
[]
[]
[]
[]
[]
[]
[]
[]
[]
[]
[]
[]
[]
[]
[]
[]
[]
[]
[]
[]
[]
[]
[]
[]
[]
[]
[]
[]
[]
[]
[]
[]
[]
[]
[]
[]
[]
[]
[]
[]
[]
[]
[]
[]
[]
[]
[]
[]
[]
[]
[]
[]
[]
[]
[]
[]
[]
[]
[]
[]
[]
[]
[]
[]
[]
[]
[]
[]
[]
[]
[]
[]
[]
[]
[]
[]
[]
[]
[]
[]
[]
[]
[]
[]
[]
[]
[]
[]
[]
[]
[]
[]
[]
[]
[]
[]
[]
[]
[]
[]
[]
[]
[]
[]
[]
[]
[]
[]
[]
[]
[]
[]
[]
[]
[]
[]
[]
[]
[]
[]
[]
[]
[]
[]
[]
[]
[]
[]
[]
[]
[]
[]
[]
[]
[]
[]
[]
[]
[]
[]
[]
[]
[]
[]
[]
[]
[]
[]
[]
[]
[]
[]
[]
[]
[]
[]
[]
[]
[]
[]
[]
[]
[]
[]
[]
[]
[]
[]
[]
[]
[]
[]
[]
[]
[]
[]
[]
[]
[]
[]
[]
[]
[]
[]
[]
[]
[]
[]
[]
[]
[]
[]
[]
[]
[]
[]
[]
[]
[]
[]
[]
[]
[]
[]
[]
[]
[]
[]
[]
[]
[]
[]
[]
[]
[]
[]
[]
[]
[]
[]
[]
[]
[]
[]
[]
[]
[]
[]
[]
[]
[]
[]
[]
[]
[]
[]
[]
[]
[]
[]
[]
[]
[]
[]
[]
[]
[]
[]
[]
[]
[]
[]
[]
[]
[]
[]
[]
[]
[]
[]
[]
[]
[]
[]
[]
[]
[]
[]
[]
[]
[]
[]
[]
[]
[]
[]
[]
[]
[]
[]
[]
[]
[]
[]
[]
[]
[]
[]
[]
[]
[]
[]
[]
[]
[]
[]
[]
[]
[]
[]
[]
[]
[]
[]
[]
[]
[]
[]
[]
[]
[]
[]
[]
[]
[]
[]
[]
[]
[]
[]
[]
[]
[]
[]
[]
[]
[]
[]
[]
[]
[]
[]
[]
[]
[]
[]
[]
[]
[]
[]
[]
[]
[]
[]
[]
[]
[]
[]
[]
[]
[]
[]
[]
[]
[]
[]
[]
[]
[]
[]
[]
[]
[]
[]
[]
[]
[]
[]
[]
[]
[]
[]
[]
[]
[]
[]
[]
[]
[]
[]
[]
[]
[]
[]
[]
[]
[]
[]
[]
[]
[]
[]
[]
[]
[]
[]
[]
[]
[]
[]
[]
[]
[]
[]
[]
[]
[]
[]
[]
[]
[]
[]
[]
[]
[]
[]
[]
[null,null,null,null,null,null,null,null,null,null,null,711]

{"sheet":"Viðmið","index":3,"n_rows":39,"n_cols":21,"rows_kept":39,"cut":false,"hidden":false,"merged":[]}
[1000,"stiga tafla fyrir KVK"]
[null,"50 skrið","100 skrið","200 skrið","400 skrið","800 skrið","1500 skrið","50 flug","100 flug","200 flug","50 bak","100 bak","200 bak","50 bringa","100 bringa","200 bringa","100 fjór","150 þrí","200 fjór","400 fjór"]
["S1",null,null,null,null,null,null,null,null,null,null,null,null,null,null,null,null,null,null,null,"S1"]
["S2","00:00:55.247","00:02:01.227","00:04:23.035","00:09:14.963","00:18:54.722","00:35:54.665","00:00:56.877","00:02:09.539","00:04:43.593","00:01:03","00:02:15.313","00:04:48.831","00:01:08.634","00:02:29.817","00:05:23.870","00:02:16.621","00:05:00.160","00:04:53.627","00:10:24.948","S2"]
["S3","00:00:46.400","00:01:37.180","00:03:35.886","00:07:35.485","00:15:31.321","00:29:28.437","00:00:46.682","00:01:46.319","00:03:52.758","00:00:51.707","00:01:51.058","00:03:57.058","00:00:56.331","00:02:02.962","00:04:25.816","00:01:52.132","00:03:08.320","00:04:00.994","00:08:32.925","S3"]
["S4","00:00:41.290","00:01:30.602","00:03:16.585","00:06:54.763","00:14:08.057","00:26:50.333","00:00:42.508","00:01:36.813","00:03:31.949","00:00:50.490","00:01:48.443","00:03:51.478","00:00:47.585","00:01:43.870","00:03:44.543","00:01:42.107","00:03:05.100","00:03:39.448","00:07:47.068","S4"]
["S5","00:00:35.880","00:01:18.550","00:02:49.740","00:05:59.378","00:12:14.813","00:23:15.299","00:00:41.760","00:01:35.110","00:03:28.219","00:00:42.089","00:01:30.400","00:03:12.963","00:00:43.535","00:01:35.030","00:03:25.433","00:01:30.001",null,"00:03:13.430","00:06:51.691","S5"]
["S6","00:00:34.140","00:01:12.210","00:02:36.833","00:05:19.170","00:11:16.569","00:21:24.702","00:00:36.050","00:01:22.105","00:02:59.748","00:00:39.440","00:01:24.710","00:03:00.818","00:00:43.498","00:01:34.950","00:03:25.260","00:01:24.226",null,"00:03:01.020","00:06:25.278","S6"]
["S7","00:00:32.310","00:01:08.030","00:02:27.722","00:04:59.020","00:10:37.265","00:20:10.070","00:00:34.800","00:01:19.258","00:02:53.516","00:00:37.978","00:01:21.570","00:02:54.115","00:00:40.557","00:01:28.530","00:03:11.382","00:01:21.156",null,"00:02:54.420","00:06:11.230","S7"]
["S8","00:00:30.130","00:01:04.710","00:02:18.926","00:04:40.440","00:09:59.318","00:18:58.014","00:00:29.945","00:01:08.200","00:02:29.307","00:00:36.046","00:01:17.420","00:02:45.257","00:00:35.353","00:01:17.170","00:02:46.824","00:01:12.585",null,"00:02:36","00:05:32.026","S8"]
["S9","00:00:29.040","00:01:02.740","00:02:14.150","00:04:30.180","00:09:38.716","00:18:18.894","00:00:30.314","00:01:09.040","00:02:31.146","00:00:31.972","00:01:08.670","00:02:26.579","00:00:35.353","00:01:17.170","00:02:46.824","00:01:10.296",null,"00:02:31.080","00:05:21.554","S9"]
["S10","00:00:27.780","00:00:59.170","00:02:09.981","00:04:32.790","00:09:20.730","00:17:44.741","00:00:27.978","00:01:03.720","00:02:19.499","00:00:30.664","00:01:05.860","00:02:20.581",null,null,null,"00:01:07.932",null,"00:02:26","00:05:10.742","S10"]
["S11","00:00:30.940","00:01:07.290","00:02:26.956","00:05:11.320","00:10:33.960","00:20:03.794","00:00:32.277","00:01:13.512","00:02:40.937","00:00:36.591","00:01:18.590","00:02:47.754","00:00:39.783","00:01:26.840","00:03:07.728","00:01:17.661",null,"00:02:46.910","00:05:55.246","S11"]
["S12","00:00:26.900","00:00:58.410","00:02:08.722","00:04:37.140","00:09:15.298","00:17:34.428","00:00:28.158","00:01:04.130","00:02:20.397","00:00:30.799","00:01:06.150","00:02:21.200","00:00:34.863","00:01:16.100","00:02:44.511","00:01:07.402",null,"00:02:24.860","00:05:08.316","S12"]
["S13","00:00:26.900","00:00:58.410","00:02:07.404","00:04:28.803","00:09:09.616","00:17:23.639","00:00:28","00:01:03.770","00:02:19.609","00:00:31.014","00:01:06.612","00:02:22.187","00:00:34.863","00:01:16.100","00:02:44.511","00:01:07.281",null,"00:02:24.600","00:05:07.762","S13"]
["S14","00:00:26.250","00:00:57.601","00:02:04.980","00:04:23.688","00:08:59.157","00:17:03.778","00:00:27.489","00:01:02.606","00:02:17.061","00:00:30.124","00:01:04.700","00:02:18.105","00:00:34.084","00:01:14.400","00:02:40.836","00:01:06.029",null,"00:02:21.910","00:05:02.038","S14"]
["S16","00:00:34.539","00:01:19.273","00:02:49.093","00:05:49.933","00:12:00.893","00:23:31.247","00:00:35.758","00:01:25.830","00:03:16.872","00:00:40.403","00:01:28.370","00:03:04.423","00:00:44.217","00:01:39.295","00:03:35.905","00:01:29.045",null,"00:03:11.377","00:06:53.857","S16"]
["S18","00:00:26.150","00:00:57.290","00:02:07.130","00:04:27.820","00:09:09.730","00:17:12.637","00:00:28.280","00:01:03.590","00:02:22.460","00:00:30.600","00:01:01.170","00:02:25.180","00:00:32.850","00:01:11.530","00:02:35.650","00:01:06.434",null,"00:02:22.780","00:05:05.310","S18"]
["S20","00:00:23.730","00:00:52.070","00:01:52.980","00:03:58.370","00:08:07.390","00:15:25.480","00:00:24.430","00:00:55.640","00:02:01.810","00:00:27.060","00:00:58.120","00:02:04.060","00:00:29.480","00:01:04.350","00:02:19.110","00:00:58.682",null,"00:02:06.120","00:04:28.430","S20"]
[]
[1000,"stiga tafla fyrir KVK"]
[null,"50 skrið","100 skrið","200 skrið","400 skrið","800 skrið","1500 skrið","50 flug","100 flug","200 flug","50 bak","100 bak","200 bak","50 bringa","100 bringa","200 bringa","100 fjór","150 þrí","200 fjór","400 fjór"]
["S1","00:00:55.919","00:02:05.451","00:04:32.778","00:09:48.532","00:20:09.101","00:38:49.363","00:00:59.984","00:02:13.233","00:04:58.210","00:01:04.290","00:02:18.903","00:04:59.307","00:01:10.655","00:02:34.895","00:05:39.662","00:02:20.880",null,"00:05:04.869","00:10:52.100","S1"]
["S2","00:00:58.430","00:02:03.710","00:04:17.860","00:09:43.888","00:19:59.561","00:38:30.983","00:00:56.558","00:02:05.623","00:04:41.176","00:00:59.420","00:02:08.381","00:04:36.634","00:00:57.500","00:02:06.056","00:04:36.422","00:01:54.650","00:04:23.370","00:04:08.107","00:08:50.689","S2"]
["S3","00:00:37.957","00:01:25.154","00:03:05.157","00:06:39.485","00:13:40.717","00:26:21.131","00:00:40.716","00:01:30.436","00:03:22.420","00:00:42.510","00:01:31.846","00:03:17.908","00:00:49.200","00:01:47.860","00:03:56.521","00:01:35.627","00:02:43.720","00:03:26.940","00:07:22.634","S3"]
["S4","00:00:37.850","00:01:22.850","00:02:56.230","00:06:29.086","00:13:19.353","00:25:39.973","00:00:38.873","00:01:26.342","00:03:13.256","00:00:42.510","00:01:31.846","00:03:17.908","00:00:42.089","00:01:32.270","00:03:22.334","00:01:31.298","00:02:25.980","00:03:17.571","00:07:02.594","S4"]
["S5","00:00:31.940","00:01:08.850","00:02:26.720","00:05:25.237","00:11:08.178","00:21:27.261","00:00:33.980","00:01:15.474","00:02:48.930","00:00:34.990","00:01:15.598","00:02:42.899","00:00:42.089","00:01:32.270","00:03:22.334","00:01:18.994",null,"00:02:50.945","00:06:05.643","S5"]
["S6","00:00:28.570","00:01:04.600","00:02:18.940","00:04:55.560","00:10:15.857","00:19:46.464","00:00:29.900","00:01:06.412","00:02:28.647","00:00:33.760","00:01:12.940","00:02:37.171","00:00:36.569","00:01:20.170","00:02:55.801","00:01:13.298",null,"00:02:38.620","00:05:39.280","S6"]
["S7","00:00:27.840","00:01:00.570","00:02:12.295","00:04:39.140","00:09:46.404","00:18:49.722","00:00:29.490","00:01:05.501","00:02:26.609","00:00:32.177","00:01:09.520","00:02:29.801","00:00:34.977","00:01:16.680","00:02:48.148","00:01:10.761",null,"00:02:33.130","00:05:27.537","S7"]
["S8","00:00:25.320","00:00:55.840","00:02:02.480","00:04:24.320","00:09:02.897","00:17:25.904","00:00:27.283","00:01:00.600","00:02:15.638","00:00:29.307","00:01:03.320","00:02:16.442","00:00:30.585","00:01:07.050","00:02:27.031","00:01:05.803",null,"00:02:22.400","00:05:04.586","S8"]
["S9","00:00:25.130","00:00:54.180","00:01:58.744","00:04:09.930","00:08:46.340","00:16:54.006","00:00:26.523","00:00:58.910","00:02:11.856","00:00:28.877","00:01:02.390","00:02:14.438","00:00:29.202","00:01:04.020","00:02:20.386","00:01:02.273",null,"00:02:14.760","00:04:48.245","S9"]
["S10","00:00:23.160","00:00:51.070","00:01:52.304","00:04:03.570","00:08:17.794","00:15:59.013","00:00:25.370","00:00:56.350","00:02:06.126","00:00:27.567","00:00:59.560","00:02:08.340",null,null,null,"00:01:00.078",null,"00:02:10.010","00:04:38.085","S10"]
["S11","00:00:25.270","00:00:56.780","00:02:04.329","00:04:32.410","00:09:11.096","00:17:41.701","00:00:28.355","00:01:02.980","00:02:20.965","00:00:31.385","00:01:07.810","00:02:26.117","00:00:31.980","00:01:10.110","00:02:33.741","00:01:05.803",null,"00:02:22.400","00:05:04.586","S11"]
["S12","00:00:23.360","00:00:51.400","00:01:53.236","00:04:05.950","00:08:21.926","00:16:06.972","00:00:25.591","00:00:56.840","00:02:07.223","00:00:27.470","00:00:59.350","00:02:07.887","00:00:29.225","00:01:04.070","00:02:20.496","00:01:00.475",null,"00:02:10.870","00:04:39.924","S12"]
["S13","00:00:23.200","00:00:50.850","00:01:50.972","00:03:55.560","00:08:11.891","00:15:47.639","00:00:24.510","00:00:54.440","00:02:01.851","00:00:26.262","00:00:56.740","00:02:02.263","00:00:29.193","00:01:04","00:02:20.343","00:00:57.203",null,"00:02:03.790","00:04:24.780","S13"]
["S14","00:00:23.835","00:00:53.473","00:01:56.270","00:04:10.858","00:08:35.372","00:16:32.877","00:00:25.662","00:00:56.998","00:02:07.577","00:00:27.428","00:00:59.260","00:02:07.693","00:00:30.420","00:01:06.690","00:02:26.241","00:01:00.270",null,"00:02:10.425","00:04:38.973","S14"]
["S16","00:00:28.499","00:01:04.137","00:02:25.460","00:05:15.846","00:10:27.361","00:21:33.186","00:00:30.180","00:01:12.255","00:02:45.048","00:00:33.625","00:01:16.346","00:02:48.105","00:00:37.272","00:01:25.128","00:03:05.522","00:01:15.296",null,"00:02:42.942","00:06:05.706","S16"]
["S18","00:00:23.340","00:00:51.220","00:01:53.120","00:03:53.420","00:08:16.406","00:16:08.560","00:00:24.820","00:00:53.900","00:02:01.710","00:00:27.060","00:00:58.120","00:02:05.640","00:00:27.790","00:01:00","00:02:12.500","00:00:56.991",null,"00:02:03.330","00:04:16.920","S18"]
["S20","00:00:20.910","00:00:46.910","00:01:42","00:03:40.070","00:07:32.120","00:14:31.020","00:00:22.430","00:00:49.820","00:01:51.510","00:00:24.040","00:00:51.940","00:01:51.920","00:00:26.420","00:00:57.920","00:02:07.010","00:00:52.679",null,"00:01:54","00:04:03.840","S20"]

{"sheet":"Met25","index":4,"n_rows":39,"n_cols":21,"rows_kept":39,"cut":false,"hidden":false,"merged":[]}
["Íslandsment 25m Braut - KVK"]
[null,"50 skrið","100 skrið","200 skrið","400 skrið","800 skrið","1500 skrið","50 flug","100 flug","200 flug","50 bak","100 bak","200 bak","50 bringa","100 bringa","200 bringa","100 fjór","150 þrísund","200 fjór","400 fjór"]
["S1",null,null,null,null,null,null,null,null,null,null,null,null,null,null,null,null,null,null,null,"S1"]
["S2","00:01:54.420","00:04:08",null,null,null,null,null,null,null,"00:02:00.730",null,null,"00:02:25.750",null,null,null,null,null,null,"S2"]
["S3","00:01:44.470","00:03:48",null,null,null,null,"00:01:52",null,null,"00:01:30.200",null,null,"00:02:16.020",null,null,null,null,null,null,"S3"]
["S4","00:01:01.270","00:02:15.980","00:04:20","00:09:00",null,null,"00:01:41",null,null,"00:01:10.500",null,null,"00:01:43.700","00:03:59",null,null,null,null,null,"S4"]
["S5","00:00:50.160","00:01:51.840","00:03:59","00:08:53",null,null,"00:01:21",null,null,"00:00:57.630","00:02:08.020",null,"00:01:06.700","00:02:23.800","00:05:03.190","00:02:32.440",null,null,null,"S5"]
["S6","00:00:39.490","00:01:24.090","00:03:17","00:06:46","00:13:37",null,"00:00:59","00:02:07",null,"00:00:56.350","00:02:04.260","00:04:15.770","00:01:06.700","00:02:23.800","00:03:35.060","00:02:06.870",null,"00:04:29.560",null,"S6"]
["S7","00:00:35.310","00:01:16.810","00:02:56","00:06:18","00:13:26",null,"00:00:45","00:01:34",null,"00:00:40.200","00:01:25.140","00:03:06.850","00:00:44.080","00:01:36.290","00:03:35.060","00:01:30.040",null,"00:03:14.830",null,"S7"]
["S8","00:00:35.310","00:01:16.810","00:02:56","00:06:18","00:13:26",null,"00:00:43","00:01:34",null,"00:00:42.630","00:01:25.140","00:03:06.850","00:00:49.760","00:01:42.110","00:03:35.060","00:01:30.040",null,"00:03:14.830",null,"S8"]
["S9","00:00:32.820","00:01:10.960","00:02:33","00:05:20","00:11:02",null,"00:00:41","00:01:34",null,"00:00:42.690","00:01:19.860","00:03:06.850","00:00:47.090","00:01:45.160",null,"00:01:32",null,"00:02:57.630",null,"S9"]
["S10","00:00:32.820","00:01:10.960","00:02:49","00:05:42","00:11:02",null,"00:00:40","00:01:32",null,"00:00:42.380","00:01:31.700","00:03:06.850",null,null,null,"00:01:33.440",null,"00:03:08.980",null,"S10"]
["S11","00:00:54","00:02:26",null,null,null,null,null,null,null,"00:00:59.790","00:02:23.870",null,"00:01:00.610","00:02:16.050",null,null,null,null,null,"S11"]
["S12",null,null,null,null,null,null,null,null,null,null,null,null,null,null,null,null,null,null,null,"S12"]
["S13","00:00:32","00:01:10","00:02:40","00:05:52","00:12:03",null,"00:00:35","00:01:19","00:02:57.330","00:00:38.150","00:01:20.330","00:02:59.660","00:00:44","00:01:32.200","00:03:10","00:01:37.910",null,"00:02:55.500","00:06:08.300","S13"]
["S14","00:00:31","00:01:07","00:02:25","00:05:08","00:10:40",null,"00:00:36","00:01:21","00:02:58.600","00:00:37.630","00:01:20.610","00:02:50.250","00:00:39.770","00:01:27.700","00:03:07.400","00:01:19.440",null,"00:02:46.100","00:06:21.820","S14"]
["S16",null,null,null,null,null,null,null,null,null,null,null,null,null,null,null,null,null,null,null,"S16"]
["S18",null,null,null,null,null,null,null,null,null,null,null,null,null,null,null,null,null,null,null,"S18"]
["S20",null,null,null,null,null,null,null,null,null,null,null,null,null,null,null,null,null,null,null,"S20"]
[]
["Íslandsment 25m Braut - KK"]
[null,"50 skrið","100 skrið","200 skrið","400 skrið","800 skrið","1500 skrið","50 flug","100 flug","200 flug","50 bak","100 bak","200 bak","50 bringa","100 bringa","200 bringa","100 fjór","150 þrísund","200 fjór","400 fjór"]
["S1",null,null,null,null,null,null,null,null,null,null,null,null,null,null,null,null,null,null,null,"S1"]
["S2",null,null,null,null,null,null,null,null,null,null,null,null,null,null,null,null,null,null,null,"S2"]
["S3","00:00:57.640","00:02:07.100","00:04:17.570","00:09:09.750",null,null,null,null,null,"00:01:28.820",null,null,"00:01:46.360",null,null,null,"00:05:34.420",null,null,"S3"]
["S4","00:01:01.610","00:02:40.380","00:04:50.540","00:09:09.750",null,null,null,null,null,"00:01:24.090","00:03:43.390",null,"00:01:00.870","00:02:19.140",null,null,"00:04:46.570",null,null,"S4"]
["S5","00:00:44.160","00:01:32.200","00:03:15.950","00:07:09.130","00:14:24.540",null,"00:00:58.140",null,null,"00:00:56.040","00:01:49.530",null,"00:01:05.920","00:02:33.220",null,"00:01:57.480",null,"00:04:02.770",null,"S5"]
["S6","00:00:37.030","00:01:23.890","00:02:56.380","00:06:20.020","00:14:08.160","00:26:38.810","00:00:44.020","00:01:37.710","00:03:38.660","00:00:49.350","00:01:42.210","00:03:27.160","00:00:44.070","00:01:35.370","00:03:27.350","00:01:45.080",null,"00:03:32.190",null,"S6"]
["S7","00:00:35.070","00:01:17.010","00:02:49.040","00:06:01","00:12:28.520","00:24:16.630","00:00:38.860","00:01:29.630","00:03:20.110","00:00:45.620","00:01:34.910","00:03:29.590","00:00:54.540","00:01:35.370","00:03:27.350","00:01:29.170",null,"00:03:16.640",null,"S7"]
["S8","00:00:37.130","00:01:13.210","00:02:56.410","00:06:14.910","00:12:28.520","00:24:03.610","00:00:44.750","00:01:36.140","00:02:26.040","00:00:40.900","00:01:29.380","00:03:03.620","00:00:39.540","00:01:30.610","00:03:27.350","00:01:37.900",null,"00:03:16.640",null,"S8"]
["S9","00:00:27.700","00:01:00.230","00:02:09.850","00:04:35.910","00:09:51.620","00:18:24.690","00:00:29.700","00:01:04.100","00:02:26.040","00:00:33.080","00:01:09.650","00:02:50.680","00:00:35.700","00:01:14.200","00:02:39.260","00:01:14.410",null,"00:02:29.160",null,"S9"]
["S10","00:00:28.600","00:01:04.650","00:02:09.850","00:04:35.910","00:09:51.620","00:18:24.690","00:00:29.700","00:01:04.100",null,"00:00:33.080","00:01:09.650",null,null,null,null,"00:02:14.750",null,"00:02:29.160",null,"S10"]
["S11","00:00:28.350","00:01:06.860","00:02:26.730","00:05:08.590",null,null,"00:00:35.200","00:01:15.310",null,"00:00:36.010","00:01:19.140",null,"00:00:38.900","00:01:23.520","00:02:57.280","00:01:17.860",null,"00:02:41.170","00:05:55.790","S11"]
["S12",null,null,null,null,null,null,null,null,null,null,null,null,null,null,null,null,null,null,null,"S12"]
["S13","00:00:29.300","00:01:05.250","00:02:21.830","00:05:06.800",null,null,"00:00:36.790",null,null,"00:00:41.940","00:01:21.780",null,null,"00:01:22.820",null,"00:01:29.350",null,"00:02:45.700",null,"S13"]
["S14","00:00:25.600","00:00:55.040","00:02:00.310","00:04:17.090","00:08:55.890","00:16:47.980","00:00:27.980","00:01:03.880","00:02:35.700","00:00:30.930","00:01:05.330","00:02:21.180","00:00:33.100","00:01:11.600","00:02:49.490","00:01:04.800",null,"00:02:20.060","00:05:13.160","S14"]
["S16",null,null,null,null,null,null,null,null,null,null,null,null,null,null,null,null,null,null,null,"S16"]
["S18",null,null,null,null,null,null,null,null,null,null,null,null,null,null,null,null,null,null,null,"S18"]
["S20",null,null,null,null,null,null,null,null,null,null,null,null,null,null,null,null,null,null,null,"S20"]

{"sheet":"Met50","index":5,"n_rows":39,"n_cols":21,"rows_kept":39,"cut":false,"hidden":false,"merged":[]}
["Íslandsment 50m Braut - KVK"]
[null,"50 skrið","100 skrið","200 skrið","400 skrið","800 skrið","1500 skrið","50 flug","100 flug","200 flug","50 bak","100 bak","200 bak","50 bringa","100 bringa","200 bringa","100 fjór","150 þrísund","200 fjór","400 fjór"]
["S1",null,null,null,null,null,null,null,null,null,null,null,null,null,null,null,null,null,null,null,"S1"]
["S2","00:01:54","00:04:08",null,null,null,null,"00:02:00.510",null,"00:01:52.150","00:03:49.940",null,null,"00:02:20.550",null,null,null,null,null,null,"S2"]
["S3","00:01:44","00:03:48","00:05:00",null,null,null,"00:01:51.450",null,"00:01:18.570","00:02:48.760",null,null,"00:01:59.700",null,null,null,null,null,null,"S3"]
["S4","00:01:01","00:02:16","00:04:36",null,null,null,"00:01:05.470",null,"00:01:02.840","00:02:16.180",null,null,"00:01:52.920",null,null,null,"00:04:42.260",null,null,"S4"]
["S5","00:00:50","00:01:52","00:04:06",null,null,null,"00:01:02.640",null,"00:00:54.120","00:02:00.560",null,null,"00:00:55.610","00:01:59.320","00:04:11.390",null,null,"00:06:06.760",null,"S5"]
["S6","00:00:39","00:01:24","00:02:59","00:06:03.670","00:14:01.510",null,"00:00:47.320","00:02:10.260","00:00:54.120","00:01:53.850","00:03:58.520",null,"00:00:56.160","00:02:00.060","00:04:11.390",null,null,"00:03:40.190",null,"S6"]
["S7","00:00:35","00:01:17","00:02:58","00:06:03.670","00:14:01.510",null,"00:00:45.950","00:01:38.270","00:00:40.050","00:01:25.560","00:03:08.230",null,"00:00:44.980","00:01:35.640","00:03:39.330",null,null,"00:03:14.130",null,"S7"]
["S8","00:00:35","00:01:17","00:02:58","00:06:03.670","00:14:01.510",null,"00:00:44.550","00:01:38.270","00:00:40.050","00:01:25.560","00:03:08.230",null,"00:00:44.980","00:01:35.640","00:03:39.330",null,null,"00:03:14.130",null,"S8"]
["S9","00:00:33","00:01:11","00:02:35","00:05:19.900","00:14:01.510",null,"00:00:37.960","00:01:21.400","00:00:40.050","00:01:20.700","00:03:08.230",null,"00:00:44.980","00:01:35.640","00:03:39.330",null,null,"00:03:00.180",null,"S9"]
["S10","00:00:33","00:01:11","00:02:35","00:05:19.900","00:14:01.510",null,"00:00:37.960","00:01:21.400","00:00:40.050","00:01:20.700","00:03:08.230",null,null,null,null,null,null,"00:03:00.180",null,"S10"]
["S11","00:00:52","00:02:00","00:03:40","00:07:46.980","00:16:02.510",null,"00:00:49.710","00:01:50.990",null,"00:01:00.330","00:02:05.630","00:04:11.630","00:01:00.090","00:02:15.600","00:04:43.310",null,null,"00:04:10.360",null,"S11"]
["S12","00:00:40","00:01:28","00:03:13","00:06:56.830","00:14:03.840",null,"00:00:43.930","00:01:38.090",null,"00:00:47.480","00:01:41.980","00:03:37.690","00:00:52.290","00:01:54.150","00:04:06.770",null,null,"00:03:42",null,"S12"]
["S13","00:00:32","00:01:13","00:03:06","00:05:50.460","00:12:03.430",null,"00:00:36.550","00:01:19.430",null,"00:00:38.820","00:01:19.230","00:02:59.850","00:00:45.630","00:01:36.100","00:03:29.310",null,null,"00:02:52.150",null,"S13"]
["S14","00:00:31","00:01:06","00:02:23","00:05:09.740","00:10:28.870","00:20:16.460","00:00:34.200","00:01:19.710","00:03:00.930","00:00:37.670","00:01:20.020","00:02:47.860","00:00:39.230","00:01:24.140","00:03:00.490",null,null,"00:02:44.260","00:05:43.050","S14"]
["S16",null,null,null,null,null,null,null,null,null,null,null,null,null,null,null,null,null,null,null,"S16"]
["S18",null,null,null,null,null,null,null,null,null,null,null,null,null,null,null,null,null,null,null,"S18"]
["S20",null,null,null,null,null,null,null,null,null,null,null,null,null,null,null,null,null,null,null,"S20"]
[]
["Íslandsment 50m Braut - KK"]
[null,"50 skrið","100 skrið","200 skrið","400 skrið","800 skrið","1500 skrið","50 flug","100 flug","200 flug","50 bak","100 bak","200 bak","50 bringa","100 bringa","200 bringa","100 fjór","150 þrísund","200 fjór","400 fjór"]
["S1","00:01:23.880","00:03:08.180",null,null,null,null,null,null,null,"00:01:36.440",null,null,null,null,null,null,null,null,null,"S1"]
["S2","00:01:31.570","00:03:05.560",null,null,null,null,null,null,null,"00:01:29.130",null,null,"00:01:26.250",null,null,null,null,null,null,"S2"]
["S3","00:00:54.270","00:01:55.540","00:04:04.660",null,null,null,null,null,null,"00:01:40.100",null,null,null,"00:03:10.230",null,null,"00:04:05.580",null,null,"S3"]
["S4","00:00:54.270","00:01:55.540","00:04:04.660",null,null,null,null,null,null,"00:01:33.300",null,null,"00:00:58.110","00:02:10.860",null,null,"00:03:38.970",null,null,"S4"]
["S5","00:00:43.740","00:01:31.620","00:03:10.840","00:08:04.990",null,null,"00:00:53.960",null,null,"00:00:55.350","00:01:56.100",null,"00:00:58.110","00:02:10.860","00:05:14.530",null,null,"00:03:55.060",null,"S5"]
["S6","00:00:37.150","00:01:24.130","00:03:03.260","00:06:27.100","00:13:10.400","00:25:53.260","00:00:43.720","00:01:41.260",null,"00:00:50.010","00:01:47.800","00:03:42.770","00:00:44.820","00:01:34.430","00:03:39.630",null,null,"00:03:37.590",null,"S6"]
["S7","00:00:35.060","00:01:17.460","00:02:52.120","00:06:01","00:13:10.400","00:25:13.250","00:00:36.690","00:01:29.180","00:03:26.320","00:00:47.070","00:01:39.210","00:03:20.630","00:00:44.820","00:01:34.430","00:03:39.630",null,null,"00:03:10.100","00:07:19.830","S7"]
["S8","00:00:35.060","00:01:16.970","00:02:49.260","00:05:53.250","00:12:46.490","00:23:57.880","00:00:36.690","00:01:29.180",null,"00:00:39.770","00:01:24.850","00:03:01.220","00:00:44.260","00:01:34.430","00:03:39.630",null,null,"00:03:10.100",null,"S8"]
["S9","00:00:28.340","00:01:01.690","00:02:19.430","00:04:41.070","00:09:41.990","00:19:48.500","00:00:29.750","00:01:04.560","00:02:31.790","00:00:39.500","00:01:13.740","00:02:59.760","00:00:34.860","00:01:19.200","00:02:58.240",null,null,"00:02:32.890",null,"S9"]
["S10","00:00:28.340","00:01:01.690","00:02:19.430","00:04:41.070","00:09:41.990","00:19:48.500","00:00:29.750","00:01:04.560","00:02:31.790","00:00:39.500","00:01:13.740",null,null,null,null,null,null,"00:02:32.890",null,"S10"]
["S11","00:00:30.620","00:01:05.650","00:02:24.080","00:05:02.380","00:10:32.160","00:20:24.930","00:00:34.780","00:01:14.400","00:02:52","00:00:38.560","00:01:17.530",null,"00:00:37.680","00:01:21.730","00:03:05.270",null,null,"00:02:39","00:06:04.020","S11"]
["S12","00:00:30.620","00:01:05.650","00:02:24.080","00:05:02.380","00:10:32.160","00:20:24.930","00:00:34.780","00:01:14.400","00:02:51","00:00:38.560","00:01:17.530",null,"00:00:37.680","00:01:21.730","00:03:05.270",null,null,"00:02:39","00:06:04.020","S12"]
["S13","00:00:29.690","00:01:06.480","00:02:34.680","00:05:20.100","00:10:32.160","00:20:24.930","00:00:32.300","00:01:14.570","00:02:50.370",null,"00:01:25.100",null,"00:00:39.080","00:01:24.060","00:03:03.740",null,null,"00:02:43.120","00:05:51.940","S13"]
["S14","00:00:25.130","00:00:54.470","00:01:56.940","00:04:13.700","00:08:53.130","00:17:18.030","00:00:27.240","00:01:00.570","00:02:42.580","00:00:31.770","00:01:08.140","00:02:28.050","00:00:33.300","00:01:13.810","00:02:46.800",null,null,"00:02:18.790","00:05:01.320","S14"]
["S16",null,null,null,null,null,null,null,null,null,null,null,null,null,null,null,null,null,null,null,"S16"]
["S18",null,null,null,null,null,null,null,null,null,null,null,null,null,null,null,null,null,null,null,"S18"]
["S20",null,null,null,null,null,null,null,null,null,null,null,null,null,null,null,null,null,null,null,"S20"]

{"sheet":"Verðlaun","index":6,"n_rows":147,"n_cols":10,"rows_kept":147,"cut":false,"hidden":false,"merged":[]}
["1. Grein: Drengir 50m Baksund"]
[]
[null,"Róbert Í Jónsson",14,"Íþróttafélagið Fjörður        ","S14","00:00:36.540","00:00:27.428","00:00:33.060",571.04975275844936,""]
[null,"Már Gunnarsson",16,"NES                           ","S12","00:00:37","00:00:27.470","00:00:36.780",416.60506842433557,""]
[null,"Björn  Axel Agnarsson",13,"ÍFR                           ","S20","00:00:39.020","00:00:24.040","00:00:34.160",348.53773449372221,""]
[null,"Fannar Logi Jóhannesson",15,"Sundfélagið Óðinn             ","S","00:00:46.550",{"$error":"#N/A"},"00:00:44.170",239]
[null,"Ingólfur M Bjarnason",15,"NES                           ","S10","00:00:46","00:00:27.567","00:00:58.450",104.90787131682642,""]
[null,"Snævar Örn Kristmannsson",9,"ÍFR                           ","S14","00:01:11.080","00:00:27.428","00:01:00.080",95.1464794776237,""]
[null,"Baldur M Kristinsson",10,"Íþróttafélagið Fjörður        ","S14","00:01:21.600","00:00:27.428","00:01:01.890",87.040433926308111,""]
[null,"Hjalti G Guðmundsson",0,"Íþróttafélagið Ösp            ","S14","NT","00:00:27.428","00:01:06.760",69.347931498846634,""]
[null,"Leó Baldurrson",10,"NES                           ","S14","00:00:00","00:00:27.428","00:01:20.820",39.086425654984069,""]
[null,"Jóhann Stígur Eiríksson",15,"Íþróttafélagið Ösp            ","S14","00:01:29.560","00:00:27.428","00:01:22.040",37.368489258811962,""]
[null,"Þorleifur Pálmi Páls",12,"Íþróttafélagið Ösp            ","S14","00:01:24.660","00:00:27.428","00:01:37.990",21.929928844779305,""]
[null,"Róbert Salvar Reynisson",16,"NES                           ","S9","00:00:52","00:00:28.877"]
[null,"Logi Ingólfsson",9,"Sundfélagið Óðinn             ","S","00:00:00",{"$error":"#N/A"},"DQ"]
[null,"Unnar I Ingason",14,"Íþróttafélagið Fjörður        ","S14","00:01:03.390","00:00:27.428","DQ"]
[null,"Alexander Guðmundsson",12,"NES                           ","S14","00:00:48","00:00:27.428","DQ"]
[null,"Hallgrímur A Heimisson",14,"Íþróttafélagið Fjörður        ","S14","00:01:00.910","00:00:27.428"]
[]
[]
["2. Grein: Stúlkur 50m Baksund"]
[]
[null,"Thórey Í Magnúsdóttir",16,"ÍFR                           ","S14","00:00:40.360","00:00:30.124","00:00:40.840",401.29357060835179]
[null,"Sandra S Gunnarsdóttir",16,"Sunddeild Fjölnis             ","S12","00:00:46.070","00:00:30.799","00:00:45.420",311.78463990393448]
[null,"Tinna Rut Andrésdóttir",16,"Sundfélagið Óðinn             ","S14","00:00:53.300","00:00:30.124","00:00:44.570",308.73900462239129]
[null,"Ástrós M Bjarnadóttir",16,"NES                           ","S18","00:00:42","00:00:30.600","00:00:46.490",285.15805307681319]
[null,"Katrín E Kristjánsdóttir",11,"Íþróttafélagið Fjörður        ","S14","00:01:13.480","00:00:30.124","00:01:05.270",98.305669176558098]
[null,"Anna R Þrastardóttir",10,"Íþróttafélagið Fjörður        ","S14","00:01:04.560","00:00:30.124","00:01:05.560",97.006886807392078]
[null,"Victoria L Karenardóttir",0,"Íþróttafélagið Fjörður        ","S14","00:01:09.070","00:00:30.124","00:01:06.070",94.777768996004724]
[null,"Gunnhildur Brynja Be",14,"Íþróttafélagið Ösp            ","S14","00:00:53.930","00:00:30.124","00:01:10.570",77.778408004251759]
[null,"Sigrún Kjartansdóttir",0,"Íþróttafélagið Fjörður        ","S14","00:01:10.570","00:00:30.124","00:01:23.190",47.479488215625835]
[null,"Arndís Atladóttir",15,"Sundfélagið Óðinn             ","S14","00:02:00.530","00:00:30.124","00:01:32.560",34.470641369930981]
[null,"Ingibjörg F Margeirsdóttir",16,"NES                           ","S14","00:00:44","00:00:30.124"]
[null,"Emelía Ý Gunnarsdóttir",9,"Íþróttafélagið Fjörður        ","S14","00:02:02.700","00:00:30.124","DQ"]
[null,"Kristjana L Albertsdóttir",0,"Íþróttafélagið Fjörður        ","S14","00:02:13.550","00:00:30.124","DQ"]
[null,"Guðbjörg S Sigfúsdóttir",15,"Íþróttafélagið Fjörður        ","S14","00:01:37.980","00:00:30.124"]
[null,"Heiður B Egilsdóttir",11,"ÍFR                           ","S8","00:01:09.430","00:00:36.046","DQ"]
[null,"Nevena Cupovic",15,"Íþróttafélagið Fjörður        ","S14","00:01:19.450","00:00:30.124"]
[null,"Sigríður Aníta Rögnvaldsóttir",13,"Íþróttafélagið Fjörður        ","S14","00:00:44.330","00:00:30.124"]
[null,"Matthildur E Sigurðardóttir",10,"NES                           ","S10","00:00:52","00:00:30.664"]
[]
[]
["3. Grein: Drengir 50m Bringusund"]
[]
[null,"Róbert Í Jónsson",14,"Íþróttafélagið Fjörður        ","S14","00:00:39.430","00:00:30.420","00:00:36.690",569.96973724321072]
[null,"Fannar Logi Jóhannesson",15,"Sundfélagið Óðinn             ","S14","00:00:43.690",{"$error":"#N/A"},"00:00:42.920",356]
[null,"Björn  Axel Agnarsson",13,"ÍFR                           ","S20","00:00:38.970","00:00:26.420","00:00:38.610",320.40481572573913]
[null,"Már Gunnarsson",16,"NES                           ","S12","00:00:42","00:00:29.225","00:00:43.030",313.30181729421759]
[null,"Reynir A Magnússon",14,"ÍFR                           ","S14","00:00:54.570","00:00:30.420","00:00:54.490",173.99810114233861]
[null,"Alexander Guðmundsson",12,"NES                           ","S14","00:00:51","00:00:30.420","00:01:08.040",89.372111300804548]
[null,"Snævar Örn Kristmannsson",9,"ÍFR                           ","S14","00:00:00","00:00:30.420","00:01:18.540",58.1061688426689]
[null,"Leó Baldurrson",10,"NES                           ","S14","00:00:00","00:00:30.420","00:01:19.380",56.280979711293838]
[null,"Jóhann Stígur Eiríksson",15,"Íþróttafélagið Ösp            ","S14","00:01:40.560","00:00:30.420","00:01:49.990",21.156086127396456]
[null,"Ingólfur M Bjarnason",15,"NES                           ","S10","00:00:50","00:00:00","00:01:02.240",0]
[null,"Róbert Salvar Reynisson",16,"NES                           ","S9","00:00:53","00:00:29.202"]
[null,"Unnar I Ingason",14,"Íþróttafélagið Fjörður        ","S14","00:00:00","00:00:30.420","DQ"]
[null,"Haukur H Loftsson",15,"ÍFR                           ","S4","00:02:36.020","00:00:42.089","DQ"]
[null,"Hjalti G Guðmundsson",0,"Íþróttafélagið Ösp            ","S14","NT","00:00:30.420","DQ"]
[null,"Óskar F Björnsson",10,"NES                           ","S14","00:01:35","00:00:30.420","DQ"]
[null,"Hallgrímur A Heimisson",14,"Íþróttafélagið Fjörður        ","S14","00:00:46.940","00:00:30.420"]
[]
[]
["4. Grein: Stúlkur 50m Bringusund"]
[]
[null,"Thórey Í Magnúsdóttir",16,"ÍFR                           ","S14","00:00:40.980","00:00:34.084","00:00:41.550",552.00435759065499]
[null,"Tinna Rut Andrésdóttir",16,"Sundfélagið Óðinn             ","S14","00:00:52.230","00:00:34.084","00:00:50.840",301.32763627325511]
[null,"Sandra S Gunnarsdóttir",16,"Sunddeild Fjölnis             ","S12","00:01:04.470","00:00:34.863","00:00:54.600",260.32317115913435]
[null,"Ástrós M Bjarnadóttir",16,"NES                           ","S18","00:00:48","00:00:32.850","00:00:52.090",250.8089611798668]
[null,"Birta Bjarnadóttir",12,"NES                           ","S","00:01:01",{"$error":"#N/A"},"00:00:57.600",207]
[null,"Anna R Þrastardóttir",10,"Íþróttafélagið Fjörður        ","S14","00:01:13.080","00:00:34.084","00:01:15.620",91.56838854959453]
[null,"Katrín E Kristjánsdóttir",11,"Íþróttafélagið Fjörður        ","S14","00:01:10.600","00:00:34.084","00:01:18.320",82.420938254744087]
[null,"Heiður B Egilsdóttir",11,"ÍFR                           ","S8","00:00:00","00:00:35.353","00:01:27.730",78.484164026025326]
[null,"Emelía Ý Gunnarsdóttir",9,"Íþróttafélagið Fjörður        ","S14","00:00:00","00:00:34.084","00:01:26.550",61.073720023462059]
[null,"Ingibjörg F Margeirsdóttir",16,"NES                           ","S14","00:00:47","00:00:34.084"]
[null,"Guðbjörg S Sigfúsdóttir",15,"Íþróttafélagið Fjörður        ","S14","00:00:00","00:00:34.084"]
[null,"Victoria L Karenardóttir",0,"Íþróttafélagið Fjörður        ","S14","00:01:36.400","00:00:34.084","DQ"]
[null,"Nevena Cupovic",15,"Íþróttafélagið Fjörður        ","S14","00:01:32.310","00:00:34.084"]
[null,"Arndís Atladóttir",15,"Sundfélagið Óðinn             ","S14","00:01:33.600","00:00:34.084","DQ"]
[null,"Sigrún Kjartansdóttir",0,"Íþróttafélagið Fjörður        ","S14","00:00:00","00:00:34.084","DQ"]
[null,"Sigríður Aníta Rögnvaldsóttir",13,"Íþróttafélagið Fjörður        ","S14","00:00:58.150","00:00:34.084"]
[]
[]
["7. Grein: Drengir 50m Skriðsund"]
[]
[null,"Róbert Í Jónsson",14,"Íþróttafélagið Fjörður        ","S14","00:00:28.480","00:00:23.835","00:00:28.750",569.83753606977689]
[null,"Már Gunnarsson",16,"NES                           ","S12","00:00:31","00:00:23.360","00:00:31.940",391.21345216786546]
[null,"Björn  Axel Agnarsson",13,"ÍFR                           ","S20","00:00:30.520","00:00:20.910","00:00:29.720",348.26969308268224]
[null,"Fannar Logi Jóhannesson",15,"Sundfélagið Óðinn             ","S14","00:00:35.840","00:00:23.835","00:00:36.130",287.11819550657344]
[null,"Ingólfur M Bjarnason",15,"NES                           ","S10","00:00:36","00:00:23.160","00:00:41.880",169.12026331456292]
[null,"Alexander Guðmundsson",12,"NES                           ","S14","00:00:37","00:00:23.835","00:00:43.220",167.729832362271]
[null,"Unnar I Ingason",14,"Íþróttafélagið Fjörður        ","S14","00:00:59.420","00:00:23.835","00:00:48.010",122.36845666294093]
[null,"Snævar Örn Kristmannsson",9,"ÍFR                           ","S14","00:00:51.320","00:00:23.835","00:00:53.010",90.905715181730656]
[null,"Hjalti G Guðmundsson",0,"Íþróttafélagið Ösp            ","S14","NT","00:00:23.835","00:00:56.940",73.352042631844654]
[null,"Reynir A Magnússon",14,"ÍFR                           ","S14","00:00:50.170","00:00:23.835","00:00:57.380",71.677519711783773]
[null,"Baldur M Kristinsson",10,"Íþróttafélagið Fjörður        ","S14","00:01:17.730","00:00:23.835","00:01:02.580",55.253262187379462]
[null,"Leó Baldurrson",10,"NES                           ","S14","00:01:15","00:00:23.835","00:01:04.500",50.464439811153454]
[null,"Jóhann Stígur Eiríksson",15,"Íþróttafélagið Ösp            ","S14","00:00:51.320","00:00:23.835","00:01:12.170",36.024211578243737]
[null,"Haukur H Loftsson",15,"ÍFR                           ","S4","00:02:12.360","00:00:37.850","00:02:40.810",31.060382279628012]
[null,"Þorleifur Pálmi Páls",12,"Íþróttafélagið Ösp            ","S14","00:01:17.250","00:00:23.835","00:01:23.690",23.101697723665996]
[null,"Óskar F Björnsson",10,"NES                           ","S14","00:01:25","00:00:23.835","00:01:42.550",12.5561821255688]
[null,"Logi Ingólfsson",9,"Sundfélagið Óðinn             ","S","00:00:00",{"$error":"#N/A"},"00:01:53.600",6]
[null,"Róbert Salvar Reynisson",16,"NES                           ","S9","00:00:37","00:00:25.130"]
[null,"Guðmundur A Sigurðsson",10,"Íþróttafélagið Fjörður        ","S10","00:01:43.750","00:00:23.160"]
[null,"Hallgrímur A Heimisson",14,"Íþróttafélagið Fjörður        ","S14","00:00:47.530","00:00:23.835"]
[]
[]
["8. Grein: Stúlkur 50m Skriðsund"]
[]
[null,"Thórey Í Magnúsdóttir",16,"ÍFR                           ","S14","00:00:32.120","00:00:26.250","00:00:32.480",527.91256967385232]
[null,"Sandra S Gunnarsdóttir",16,"Sunddeild Fjölnis             ","S12","00:00:36.020","00:00:26.900","00:00:37.310",374.78404388257479]
[null,"Ástrós M Bjarnadóttir",16,"NES                           ","S18","00:00:35","00:00:26.150","00:00:37.400",341.82220629562948]
[null,"Tinna Rut Andrésdóttir",16,"Sundfélagið Óðinn             ","S14","00:00:43.160","00:00:26.250","00:00:41.630",250.72106955079775]
[null,"Heiður B Egilsdóttir",11,"ÍFR                           ","S8","00:00:58.800","00:00:30.130","00:00:53.550",199.83476228233144]
[null,"Gunnhildur Brynja Be",14,"Íþróttafélagið Ösp            ","S14","00:00:30.820","00:00:26.250","00:00:48.320",160.33535127239045]
[null,"Birta Bjarnadóttir",12,"NES                           ","S14","00:00:51","00:00:26.250","00:00:52.160",127.46686841753355]
[null,"Anna R Þrastardóttir",10,"Íþróttafélagið Fjörður        ","S14","00:00:52.590","00:00:26.250","00:00:54.180",113.73471988945828]
[null,"Katrín E Kristjánsdóttir",11,"Íþróttafélagið Fjörður        ","S14","00:00:54.590","00:00:26.250","00:00:58.730",89.295600444803497]
[null,"Arndís Atladóttir",15,"Sundfélagið Óðinn             ","S14","00:01:27.880","00:00:26.250","00:01:10.840",50.883198944518284]
[null,"Sigrún Kjartansdóttir",0,"Íþróttafélagið Fjörður        ","S14","00:01:21.370","00:00:26.250","00:01:11.400",49.695312864803839]
[null,"Kristjana L Albertsdóttir",0,"Íþróttafélagið Fjörður        ","S14","00:01:57.270","00:00:26.250","00:01:57.770",11.074038761010952]
[null,"Ingibjörg F Margeirsdóttir",16,"NES                           ","S14","00:00:36","00:00:26.250"]
[null,"Guðbjörg S Sigfúsdóttir",15,"Íþróttafélagið Fjörður        ","S14","00:01:20.230","00:00:26.250"]
[null,"Victoria L Karenardóttir",0,"Íþróttafélagið Fjörður        ","S14","00:01:10.330","00:00:26.250"]
[null,"Nevena Cupovic",15,"Íþróttafélagið Fjörður        ","S14","00:01:09.460","00:00:26.250"]
[null,"Emelía Ý Gunnarsdóttir",9,"Íþróttafélagið Fjörður        ","S14","00:01:20.160","00:00:26.250","DQ"]
[null,"Sigríður Aníta Rögnvaldsóttir",13,"Íþróttafélagið Fjörður        ","S14","00:00:39.600","00:00:26.250"]
[null,"Matthildur E Sigurðardóttir",10,"NES                           ","S10","00:00:46","00:00:27.780"]
[]
[]
["9. Grein: Drengir 50m Flugsund"]
[]
[null,"Róbert Í Jónsson",14,"Íþróttafélagið Fjörður        ","S14","00:00:31.290","00:00:25.662","00:00:30.600",589.78856466601883]
[null,"Már Gunnarsson",16,"NES                           ","S12","00:00:36","00:00:25.591","00:00:35.270",381.96404151615468]
[null,"Björn  Axel Agnarsson",13,"ÍFR                           ","S20","00:00:30.340","00:00:22.430","00:00:31.080",375.87616775953461]
[null,"Fannar Logi Jóhannesson",15,"Sundfélagið Óðinn             ","S14","00:00:42.080","00:00:25.662","00:00:45.380",180.82861360374301]
[null,"Ingólfur M Bjarnason",15,"NES                           ","S10","00:00:47","00:00:25.370","00:01:08.860",50.010057880196989]
[null,"Róbert Salvar Reynisson",16,"NES                           ","S9","00:00:47","00:00:26.523"]
[null,"Alexander Guðmundsson",12,"NES                           ","S14","00:00:45","00:00:25.662"]
[]
[]
["10. Grein: Stúlkur 50m Flugsund"]
[]
[null,"Thórey Í Magnúsdóttir",16,"ÍFR                           ","S14","00:00:36.100","00:00:27.489","00:00:37.350",398.64797402307829]
[null,"Sandra S Gunnarsdóttir",16,"Sunddeild Fjölnis             ","S12","00:00:42.210","00:00:28.158","00:00:44.610",251.47573548164664]
[null,"Ástrós M Bjarnadóttir",16,"NES                           ","S18","00:00:42","00:00:28.280","00:00:51.310",167.42957367975893]
[null,"Ingibjörg F Margeirsdóttir",16,"NES                           ","S14","00:00:41","00:00:27.489"]
[null,"Sigríður Aníta Rögnvaldsóttir",13,"Íþróttafélagið Fjörður        ","S14","00:00:55.200","00:00:27.489"]