{"text_format":"1","workbook":"xlsx","n_sheets":7,"sheets":["Forsíða","Keppendur","Úrslit","Viðmið","Met25","Met50","Verðlaun"],"not_rendered":{"charts":0,"images":0,"macros":1,"external_links":0,"defined_names":0,"comments":0,"pivot_tables":0},"unopened":[],"bounds":{"document_bytes":16777216,"sheet_cells":100000,"rows_first":2000,"rows_last":500,"rows_between":2000,"halvings":0,"cell_chars":16384,"cell_head_chars":4096},"cells_cut":0,"cells_raw":0,"read":"whole","date_system":"1900"}

{"sheet":"Forsíða","index":0,"n_rows":5,"n_cols":4,"rows_kept":5,"cut":false,"hidden":false,"merged":[]}
[]
["Mót:",null,null,"Meistaramót"]
[null,null,null,"E:\\Nýársmót2016.mdb"]
["Braut:",null,null,"25m"]
["Raðir per grein:",null,null,70]

{"sheet":"Keppendur","index":1,"n_rows":89,"n_cols":10,"rows_kept":89,"cut":false,"hidden":false,"merged":[]}
[]
[]
[]
[]
[null,"Númer","Nafn","Aldur","Lið","S","SB","SM"]
[null,23,"Baldur E Traustason",11,"ÍFR                           ",14,14,14,null,"Baldur E Traustason S14"]
[null,27,"Bergdís Ó Vilhjálmsdótt",11,"ÍFR                           ",7,6,7,null,"Bergdís Ó Vilhjálmsdótt S7 Sb6"]
[null,15,"Björn  Axel Agnarsson",13,"ÍFR                           ",20,20,20,null,"Björn  Axel Agnarsson S20"]
[null,25,"Elís F Stephen",10,"ÍFR                           ",null,null,null,null,"Elís F Stephen"]
[null,16,"Haukur H Loftsson",15,"ÍFR                           ",4,4,4,null,"Haukur H Loftsson S4"]
[null,26,"Heiður B Egilsdóttir",11,"ÍFR                           ",8,8,8,null,"Heiður B Egilsdóttir S8"]
[null,24,"Hilmar L Davíðsson",10,"ÍFR                           ",10,9,10,null,"Hilmar L Davíðsson S10 SB9"]
[null,22,"Hlynur B Steingrímsson",12,"ÍFR                           ",null,null,null,null,"Hlynur B Steingrímsson"]
[null,19,"Ingi B Torsteinsson",11,"ÍFR                           ",null,null,null,null,"Ingi B Torsteinsson"]
[null,17,"Ólafur Helgason",14,"ÍFR                           ",9,8,9,null,"Ólafur Helgason S9 SB8"]
[null,29,"Ólafur F Jónasson",14,"ÍFR                           ",14,14,14,null,"Ólafur F Jónasson S14"]
[null,18,"Reynir A Magnússon",14,"ÍFR                           ",14,14,14,null,"Reynir A Magnússon S14"]
[null,28,"Snævar Örn Kristmannsson",9,"ÍFR                           ",14,14,14,null,"Snævar Örn Kristmannsson S14"]
[null,20,"Thórey Í Magnúsdóttir",16,"ÍFR                           ",14,14,14,null,"Thórey Í Magnúsdóttir S14"]
[null,21,"Torbjörn Helgason",12,"ÍFR                           ",null,null,null,null,"Torbjörn Helgason"]
{"$rows_left_out":70}
{"sheet":"Úrslit","index":2,"n_rows":1430,"n_cols":13,"rows_kept":1430,"cut":false,"hidden":false,"merged":[]}
[]
[]
[]
[]
[]
[]
[null,"1. Grein: Drengir 50m Baksund"]
[]
[null,0,{"$f":"VLOOKUP(42,Keppendur!B6:C1000,2,FALSE)","v":"Róbert Salvar Reynisson"},{"$f":"VLOOKUP(42,Keppendur!B6:D1000,3,FALSE)","v":16},{"$f":"VLOOKUP(42,Keppendur!B6:E1000,4,FALSE)","v":"NES                           "},{"$f":"CONCATENATE(\"S\",INDEX(Keppendur!F6:H1000,MATCH(42,Keppendur!B6:B1000,0),MATCH(\"S\",Keppendur!F5:H5,0)))","v":"S9"},"00:00:52",{"$f":"INDEX(Viðmið!$B$23:$T$39,MATCH(F9,Viðmið!$A$23:$A$39, 0),MATCH(\"50 bak\",Viðmið!$B$22:$T$22,0))","v":"00:00:28.877"}]
[null,"Riðill #1",null,"Aldur",null,null,"Besti tími","Viðmið","Loka Tími","Stig","Met"]
[null,3,{"$f":"VLOOKUP(35,Keppendur!B6:C1000,2,FALSE)","v":"Leó Baldurrson"},{"$f":"VLOOKUP(35,Keppendur!B6:D1000,3,FALSE)","v":10},{"$f":"VLOOKUP(35,Keppendur!B6:E1000,4,FALSE)","v":"NES                           "},{"$f":"CONCATENATE(\"S\",INDEX(Keppendur!F6:H1000,MATCH(35,Keppendur!B6:B1000,0),MATCH(\"S\",Keppendur!F5:H5,0)))","v":"S14"},"00:00:00",{"$f":"INDEX(Viðmið!$B$23:$T$39,MATCH(F11,Viðmið!$A$23:$A$39, 0),MATCH(\"50 bak\",Viðmið!$B$22:$T$22,0))","v":"00:00:27.428"},"00:01:20.820",{"$f":"POWER((10*H:H/I:I),3)","v":39.086425654984069},{"$f":"IF(I11 < INDEX('Met25'!$B$23:$T$39,MATCH(F11,'Met25'!$A$23:$A$39, 0),MATCH(\"50 bak\",'Met25'!$B$22:$T$22,0)), \"X\", \"\")","v":""}]
[null,5,{"$f":"VLOOKUP(62,Keppendur!B6:C1000,2,FALSE)","v":"Logi Ingólfsson"},{"$f":"VLOOKUP(62,Keppendur!B6:D1000,3,FALSE)","v":9},{"$f":"VLOOKUP(62,Keppendur!B6:E1000,4,FALSE)","v":"Sundfélagið Óðinn             "},{"$f":"CONCATENATE(\"S\",INDEX(Keppendur!F6:H1000,MATCH(62,Keppendur!B6:B1000,0),MATCH(\"S\",Keppendur!F5:H5,0)))","v":"S20"},"00:00:00",{"$f":"INDEX(Viðmið!$B$23:$T$39,MATCH(F12,Viðmið!$A$23:$A$39, 0),MATCH(\"50 bak\",Viðmið!$B$22:$T$22,0))","v":"00:00:24.040"},"DQ"]
[null,6,{"$f":"VLOOKUP(69,Keppendur!B6:C1000,2,FALSE)","v":"Hjalti G Guðmundsson"},{"$f":"VLOOKUP(69,Keppendur!B6:D1000,3,FALSE)","v":0},{"$f":"VLOOKUP(69,Keppendur!B6:E1000,4,FALSE)","v":"Íþróttafélagið Ösp            "},{"$f":"CONCATENATE(\"S\",INDEX(Keppendur!F6:H1000,MATCH(69,Keppendur!B6:B1000,0),MATCH(\"S\",Keppendur!F5:H5,0)))","v":"S14"},"NT",{"$f":"INDEX(Viðmið!$B$23:$T$39,MATCH(F13,Viðmið!$A$23:$A$39, 0),MATCH(\"50 bak\",Viðmið!$B$22:$T$22,0))","v":"00:00:27.428"},"00:01:06.760",{"$f":"POWER((10*H:H/I:I),3)","v":69.347931498846634},{"$f":"IF(I13 < INDEX('Met25'!$B$23:$T$39,MATCH(F13,'Met25'!$A$23:$A$39, 0),MATCH(\"50 bak\",'Met25'!$B$22:$T$22,0)), \"X\", \"\")","v":""}]
[null,"Riðill #2",null,"Aldur",null,null,"Besti tími","Viðmið","Loka Tími","Stig","Met"]
[null,3,{"$f":"VLOOKUP(9,Keppendur!B6:C1000,2,FALSE)","v":"Baldur M Kristinsson"},{"$f":"VLOOKUP(9,Keppendur!B6:D1000,3,FALSE)","v":10},{"$f":"VLOOKUP(9,Keppendur!B6:E1000,4,FALSE)","v":"Íþróttafélagið Fjörður        "},{"$f":"CONCATENATE(\"S\",INDEX(Keppendur!F6:H1000,MATCH(9,Keppendur!B6:B1000,0),MATCH(\"S\",Keppendur!F5:H5,0)))","v":"S14"},"00:01:21.600",{"$f":"INDEX(Viðmið!$B$23:$T$39,MATCH(F15,Viðmið!$A$23:$A$39, 0),MATCH(\"50 bak\",Viðmið!$B$22:$T$22,0))","v":"00:00:27.428"},"00:01:01.890",{"$f":"POWER((10*H:H/I:I),3)","v":87.040433926308111},{"$f":"IF(I15 < INDEX('Met25'!$B$23:$T$39,MATCH(F15,'Met25'!$A$23:$A$39, 0),MATCH(\"50 bak\",'Met25'!$B$22:$T$22,0)), \"X\", \"\")","v":""}]
[null,4,{"$f":"VLOOKUP(2,Keppendur!B6:C1000,2,FALSE)","v":"Unnar I Ingason"},{"$f":"VLOOKUP(2,Keppendur!B6:D1000,3,FALSE)","v":14},{"$f":"VLOOKUP(2,Keppendur!B6:E1000,4,FALSE)","v":"Íþróttafélagið Fjörður        "},{"$f":"CONCATENATE(\"S\",INDEX(Keppendur!F6:H1000,MATCH(2,Keppendur!B6:B1000,0),MATCH(\"S\",Keppendur!F5:H5,0)))","v":"S14"},"00:01:03.390",{"$f":"INDEX(Viðmið!$B$23:$T$39,MATCH(F16,Viðmið!$A$23:$A$39, 0),MATCH(\"50 bak\",Viðmið!$B$22:$T$22,0))","v":"00:00:27.428"},"DQ"]
[null,5,{"$f":"VLOOKUP(28,Keppendur!B6:C1000,2,FALSE)","v":"Snævar Örn Kristmannsson"},{"$f":"VLOOKUP(28,Keppendur!B6:D1000,3,FALSE)","v":9},{"$f":"VLOOKUP(28,Keppendur!B6:E1000,4,FALSE)","v":"ÍFR                           "},{"$f":"CONCATENATE(\"S\",INDEX(Keppendur!F6:H1000,MATCH(28,Keppendur!B6:B1000,0),MATCH(\"S\",Keppendur!F5:H5,0)))","v":"S14"},"00:01:11.080",{"$f":"INDEX(Viðmið!$B$23:$T$39,MATCH(F17,Viðmið!$A$23:$A$39, 0),MATCH(\"50 bak\",Viðmið!$B$22:$T$22,0))","v":"00:00:27.428"},"00:01:00.080",{"$f":"POWER((10*H:H/I:I),3)","v":95.1464794776237},{"$f":"IF(I17 < INDEX('Met25'!$B$23:$T$39,MATCH(F17,'Met25'!$A$23:$A$39, 0),MATCH(\"50 bak\",'Met25'!$B$22:$T$22,0)), \"X\", \"\")","v":""}]
[null,6,{"$f":"VLOOKUP(33,Keppendur!B6:C1000,2,FALSE)","v":"Þorleifur Pálmi Páls"},{"$f":"VLOOKUP(33,Keppendur!B6:D1000,3,FALSE)","v":12},{"$f":"VLOOKUP(33,Keppendur!B6:E1000,4,FALSE)","v":"Íþróttafélagið Ösp            "},{"$f":"CONCATENATE(\"S\",INDEX(Keppendur!F6:H1000,MATCH(33,Keppendur!B6:B1000,0),MATCH(\"S\",Keppendur!F5:H5,0)))","v":"S14"},"00:01:24.660",{"$f":"INDEX(Viðmið!$B$23:$T$39,MATCH(F18,Viðmið!$A$23:$A$39, 0),MATCH(\"50 bak\",Viðmið!$B$22:$T$22,0))","v":"00:00:27.428"},"00:01:37.990",{"$f":"POWER((10*H:H/I:I),3)","v":21.929928844779305},{"$f":"IF(I18 < INDEX('Met25'!$B$23:$T$39,MATCH(F18,'Met25'!$A$23:$A$39, 0),MATCH(\"50 bak\",'Met25'!$B$22:$T$22,0)), \"X\", \"\")","v":""}]
[null,7,{"$f":"VLOOKUP(30,Keppendur!B6:C1000,2,FALSE)","v":"Jóhann Stígur Eiríksson"},{"$f":"VLOOKUP(30,Keppendur!B6:D1000,3,FALSE)","v":15},{"$f":"VLOOKUP(30,Keppendur!B6:E1000,4,FALSE)","v":"Íþróttafélagið Ösp            "},{"$f":"CONCATENATE(\"S\",INDEX(Keppendur!F6:H1000,MATCH(30,Keppendur!B6:B1000,0),MATCH(\"S\",Keppendur!F5:H5,0)))","v":"S14"},"00:01:29.560",{"$f":"INDEX(Viðmið!$B$23:$T$39,MATCH(F19,Viðmið!$A$23:$A$39, 0),MATCH(\"50 bak\",Viðmið!$B$22:$T$22,0))","v":"00:00:27.428"},"00:01:22.040",{"$f":"POWER((10*H:H/I:I),3)","v":37.368489258811962},{"$f":"IF(I19 < INDEX('Met25'!$B$23:$T$39,MATCH(F19,'Met25'!$A$23:$A$39, 0),MATCH(\"50 bak\",'Met25'!$B$22:$T$22,0)), \"X\", \"\")","v":""}]
[null,"Riðill #3",null,"Aldur",null,null,"Besti tími","Viðmið","Loka Tími","Stig","Met"]
{"$rows_left_out":1411}
{"sheet":"Viðmið","index":3,"n_rows":39,"n_cols":21,"rows_kept":39,"cut":false,"hidden":false,"merged":[]}
[1000,"stiga tafla fyrir KVK"]
[null,"50 skrið","100 skrið","200 skrið","400 skrið","800 skrið","1500 skrið","50 flug","100 flug","200 flug","50 bak","100 bak","200 bak","50 bringa","100 bringa","200 bringa","100 fjór","150 þrí","200 fjór","400 fjór"]
["S1",null,null,null,null,null,null,null,null,null,null,null,null,null,null,null,null,null,null,null,"S1"]
["S2","00:00:55.247","00:02:01.227","00:04:23.035","00:09:14.963","00:18:54.722","00:35:54.665","00:00:56.877","00:02:09.539","00:04:43.593","00:01:03","00:02:15.313","00:04:48.831","00:01:08.634","00:02:29.817","00:05:23.870","00:02:16.621","00:05:00.160","00:04:53.627","00:10:24.948","S2"]
["S3","00:00:46.400","00:01:37.180","00:03:35.886","00:07:35.485","00:15:31.321","00:29:28.437","00:00:46.682","00:01:46.319","00:03:52.758","00:00:51.707","00:01:51.058","00:03:57.058","00:00:56.331","00:02:02.962","00:04:25.816","00:01:52.132","00:03:08.320","00:04:00.994","00:08:32.925","S3"]
["S4","00:00:41.290","00:01:30.602","00:03:16.585","00:06:54.763","00:14:08.057","00:26:50.333","00:00:42.508","00:01:36.813","00:03:31.949","00:00:50.490","00:01:48.443","00:03:51.478","00:00:47.585","00:01:43.870","00:03:44.543","00:01:42.107","00:03:05.100","00:03:39.448","00:07:47.068","S4"]
["S5","00:00:35.880","00:01:18.550","00:02:49.740","00:05:59.378","00:12:14.813","00:23:15.299","00:00:41.760","00:01:35.110","00:03:28.219","00:00:42.089","00:01:30.400","00:03:12.963","00:00:43.535","00:01:35.030","00:03:25.433","00:01:30.001",null,"00:03:13.430","00:06:51.691","S5"]
["S6","00:00:34.140","00:01:12.210","00:02:36.833","00:05:19.170","00:11:16.569","00:21:24.702","00:00:36.050","00:01:22.105","00:02:59.748","00:00:39.440","00:01:24.710","00:03:00.818","00:00:43.498","00:01:34.950","00:03:25.260","00:01:24.226",null,"00:03:01.020","00:06:25.278","S6"]
["S7","00:00:32.310","00:01:08.030","00:02:27.722","00:04:59.020","00:10:37.265","00:20:10.070","00:00:34.800","00:01:19.258","00:02:53.516","00:00:37.978","00:01:21.570","00:02:54.115","00:00:40.557","00:01:28.530","00:03:11.382","00:01:21.156",null,"00:02:54.420","00:06:11.230","S7"]
["S8","00:00:30.130","00:01:04.710","00:02:18.926","00:04:40.440","00:09:59.318","00:18:58.014","00:00:29.945","00:01:08.200","00:02:29.307","00:00:36.046","00:01:17.420","00:02:45.257","00:00:35.353","00:01:17.170","00:02:46.824","00:01:12.585",null,"00:02:36","00:05:32.026","S8"]
["S9","00:00:29.040","00:01:02.740","00:02:14.150","00:04:30.180","00:09:38.716","00:18:18.894","00:00:30.314","00:01:09.040","00:02:31.146","00:00:31.972","00:01:08.670","00:02:26.579","00:00:35.353","00:01:17.170","00:02:46.824","00:01:10.296",null,"00:02:31.080","00:05:21.554","S9"]
["S10","00:00:27.780","00:00:59.170","00:02:09.981","00:04:32.790","00:09:20.730","00:17:44.741","00:00:27.978","00:01:03.720","00:02:19.499","00:00:30.664","00:01:05.860","00:02:20.581",null,null,null,"00:01:07.932",null,"00:02:26","00:05:10.742","S10"]
["S11","00:00:30.940","00:01:07.290","00:02:26.956","00:05:11.320","00:10:33.960","00:20:03.794","00:00:32.277","00:01:13.512","00:02:40.937","00:00:36.591","00:01:18.590","00:02:47.754","00:00:39.783","00:01:26.840","00:03:07.728","00:01:17.661",null,"00:02:46.910","00:05:55.246","S11"]
["S12","00:00:26.900","00:00:58.410","00:02:08.722","00:04:37.140","00:09:15.298","00:17:34.428","00:00:28.158","00:01:04.130","00:02:20.397","00:00:30.799","00:01:06.150","00:02:21.200","00:00:34.863","00:01:16.100","00:02:44.511","00:01:07.402",null,"00:02:24.860","00:05:08.316","S12"]
["S13","00:00:26.900","00:00:58.410","00:02:07.404","00:04:28.803","00:09:09.616","00:17:23.639","00:00:28","00:01:03.770","00:02:19.609","00:00:31.014","00:01:06.612","00:02:22.187","00:00:34.863","00:01:16.100","00:02:44.511","00:01:07.281",null,"00:02:24.600","00:05:07.762","S13"]
["S14","00:00:26.250","00:00:57.601","00:02:04.980","00:04:23.688","00:08:59.157","00:17:03.778","00:00:27.489","00:01:02.606","00:02:17.061","00:00:30.124","00:01:04.700","00:02:18.105","00:00:34.084","00:01:14.400","00:02:40.836","00:01:06.029",null,"00:02:21.910","00:05:02.038","S14"]
["S16","00:00:34.539","00:01:19.273","00:02:49.093","00:05:49.933","00:12:00.893","00:23:31.247","00:00:35.758","00:01:25.830","00:03:16.872","00:00:40.403","00:01:28.370","00:03:04.423","00:00:44.217","00:01:39.295","00:03:35.905","00:01:29.045",null,"00:03:11.377","00:06:53.857","S16"]
["S18","00:00:26.150","00:00:57.290","00:02:07.130","00:04:27.820","00:09:09.730","00:17:12.637","00:00:28.280","00:01:03.590","00:02:22.460","00:00:30.600","00:01:01.170","00:02:25.180","00:00:32.850","00:01:11.530","00:02:35.650","00:01:06.434",null,"00:02:22.780","00:05:05.310","S18"]
["S20","00:00:23.730","00:00:52.070","00:01:52.980","00:03:58.370","00:08:07.390","00:15:25.480","00:00:24.430","00:00:55.640","00:02:01.810","00:00:27.060","00:00:58.120","00:02:04.060","00:00:29.480","00:01:04.350","00:02:19.110","00:00:58.682",null,"00:02:06.120","00:04:28.430","S20"]
[]
{"$rows_left_out":20}
{"sheet":"Met25","index":4,"n_rows":39,"n_cols":21,"rows_kept":39,"cut":false,"hidden":false,"merged":[]}
["Íslandsment 25m Braut - KVK"]
[null,"50 skrið","100 skrið","200 skrið","400 skrið","800 skrið","1500 skrið","50 flug","100 flug","200 flug","50 bak","100 bak","200 bak","50 bringa","100 bringa","200 bringa","100 fjór","150 þrísund","200 fjór","400 fjór"]
["S1",null,null,null,null,null,null,null,null,null,null,null,null,null,null,null,null,null,null,null,"S1"]
["S2","00:01:54.420","00:04:08",null,null,null,null,null,null,null,"00:02:00.730",null,null,"00:02:25.750",null,null,null,null,null,null,"S2"]
["S3","00:01:44.470","00:03:48",null,null,null,null,"00:01:52",null,null,"00:01:30.200",null,null,"00:02:16.020",null,null,null,null,null,null,"S3"]
["S4","00:01:01.270","00:02:15.980","00:04:20","00:09:00",null,null,"00:01:41",null,null,"00:01:10.500",null,null,"00:01:43.700","00:03:59",null,null,null,null,null,"S4"]
["S5","00:00:50.160","00:01:51.840","00:03:59","00:08:53",null,null,"00:01:21",null,null,"00:00:57.630","00:02:08.020",null,"00:01:06.700","00:02:23.800","00:05:03.190","00:02:32.440",null,null,null,"S5"]
["S6","00:00:39.490","00:01:24.090","00:03:17","00:06:46","00:13:37",null,"00:00:59","00:02:07",null,"00:00:56.350","00:02:04.260","00:04:15.770","00:01:06.700","00:02:23.800","00:03:35.060","00:02:06.870",null,"00:04:29.560",null,"S6"]
["S7","00:00:35.310","00:01:16.810","00:02:56","00:06:18","00:13:26",null,"00:00:45","00:01:34",null,"00:00:40.200","00:01:25.140","00:03:06.850","00:00:44.080","00:01:36.290","00:03:35.060","00:01:30.040",null,"00:03:14.830",null,"S7"]
["S8","00:00:35.310","00:01:16.810","00:02:56","00:06:18","00:13:26",null,"00:00:43","00:01:34",null,"00:00:42.630","00:01:25.140","00:03:06.850","00:00:49.760","00:01:42.110","00:03:35.060","00:01:30.040",null,"00:03:14.830",null,"S8"]
["S9","00:00:32.820","00:01:10.960","00:02:33","00:05:20","00:11:02",null,"00:00:41","00:01:34",null,"00:00:42.690","00:01:19.860","00:03:06.850","00:00:47.090","00:01:45.160",null,"00:01:32",null,"00:02:57.630",null,"S9"]
["S10","00:00:32.820","00:01:10.960","00:02:49","00:05:42","00:11:02",null,"00:00:40","00:01:32",null,"00:00:42.380","00:01:31.700","00:03:06.850",null,null,null,"00:01:33.440",null,"00:03:08.980",null,"S10"]
["S11","00:00:54","00:02:26",null,null,null,null,null,null,null,"00:00:59.790","00:02:23.870",null,"00:01:00.610","00:02:16.050",null,null,null,null,null,"S11"]
["S12",null,null,null,null,null,null,null,null,null,null,null,null,null,null,null,null,null,null,null,"S12"]
["S13","00:00:32","00:01:10","00:02:40","00:05:52","00:12:03",null,"00:00:35","00:01:19","00:02:57.330","00:00:38.150","00:01:20.330","00:02:59.660","00:00:44","00:01:32.200","00:03:10","00:01:37.910",null,"00:02:55.500","00:06:08.300","S13"]
["S14","00:00:31","00:01:07","00:02:25","00:05:08","00:10:40",null,"00:00:36","00:01:21","00:02:58.600","00:00:37.630","00:01:20.610","00:02:50.250","00:00:39.770","00:01:27.700","00:03:07.400","00:01:19.440",null,"00:02:46.100","00:06:21.820","S14"]
["S16",null,null,null,null,null,null,null,null,null,null,null,null,null,null,null,null,null,null,null,"S16"]
["S18",null,null,null,null,null,null,null,null,null,null,null,null,null,null,null,null,null,null,null,"S18"]
["S20",null,null,null,null,null,null,null,null,null,null,null,null,null,null,null,null,null,null,null,"S20"]
[]
{"$rows_left_out":20}
{"sheet":"Met50","index":5,"n_rows":39,"n_cols":21,"rows_kept":39,"cut":false,"hidden":false,"merged":[]}
["Íslandsment 50m Braut - KVK"]
[null,"50 skrið","100 skrið","200 skrið","400 skrið","800 skrið","1500 skrið","50 flug","100 flug","200 flug","50 bak","100 bak","200 bak","50 bringa","100 bringa","200 bringa","100 fjór","150 þrísund","200 fjór","400 fjór"]
["S1",null,null,null,null,null,null,null,null,null,null,null,null,null,null,null,null,null,null,null,"S1"]
["S2","00:01:54","00:04:08",null,null,null,null,"00:02:00.510",null,"00:01:52.150","00:03:49.940",null,null,"00:02:20.550",null,null,null,null,null,null,"S2"]
["S3","00:01:44","00:03:48","00:05:00",null,null,null,"00:01:51.450",null,"00:01:18.570","00:02:48.760",null,null,"00:01:59.700",null,null,null,null,null,null,"S3"]
["S4","00:01:01","00:02:16","00:04:36",null,null,null,"00:01:05.470",null,"00:01:02.840","00:02:16.180",null,null,"00:01:52.920",null,null,null,"00:04:42.260",null,null,"S4"]
["S5","00:00:50","00:01:52","00:04:06",null,null,null,"00:01:02.640",null,"00:00:54.120","00:02:00.560",null,null,"00:00:55.610","00:01:59.320","00:04:11.390",null,null,"00:06:06.760",null,"S5"]
["S6","00:00:39","00:01:24","00:02:59","00:06:03.670","00:14:01.510",null,"00:00:47.320","00:02:10.260","00:00:54.120","00:01:53.850","00:03:58.520",null,"00:00:56.160","00:02:00.060","00:04:11.390",null,null,"00:03:40.190",null,"S6"]
["S7","00:00:35","00:01:17","00:02:58","00:06:03.670","00:14:01.510",null,"00:00:45.950","00:01:38.270","00:00:40.050","00:01:25.560","00:03:08.230",null,"00:00:44.980","00:01:35.640","00:03:39.330",null,null,"00:03:14.130",null,"S7"]
["S8","00:00:35","00:01:17","00:02:58","00:06:03.670","00:14:01.510",null,"00:00:44.550","00:01:38.270","00:00:40.050","00:01:25.560","00:03:08.230",null,"00:00:44.980","00:01:35.640","00:03:39.330",null,null,"00:03:14.130",null,"S8"]
["S9","00:00:33","00:01:11","00:02:35","00:05:19.900","00:14:01.510",null,"00:00:37.960","00:01:21.400","00:00:40.050","00:01:20.700","00:03:08.230",null,"00:00:44.980","00:01:35.640","00:03:39.330",null,null,"00:03:00.180",null,"S9"]
["S10","00:00:33","00:01:11","00:02:35","00:05:19.900","00:14:01.510",null,"00:00:37.960","00:01:21.400","00:00:40.050","00:01:20.700","00:03:08.230",null,null,null,null,null,null,"00:03:00.180",null,"S10"]
["S11","00:00:52","00:02:00","00:03:40","00:07:46.980","00:16:02.510",null,"00:00:49.710","00:01:50.990",null,"00:01:00.330","00:02:05.630","00:04:11.630","00:01:00.090","00:02:15.600","00:04:43.310",null,null,"00:04:10.360",null,"S11"]
["S12","00:00:40","00:01:28","00:03:13","00:06:56.830","00:14:03.840",null,"00:00:43.930","00:01:38.090",null,"00:00:47.480","00:01:41.980","00:03:37.690","00:00:52.290","00:01:54.150","00:04:06.770",null,null,"00:03:42",null,"S12"]
["S13","00:00:32","00:01:13","00:03:06","00:05:50.460","00:12:03.430",null,"00:00:36.550","00:01:19.430",null,"00:00:38.820","00:01:19.230","00:02:59.850","00:00:45.630","00:01:36.100","00:03:29.310",null,null,"00:02:52.150",null,"S13"]
["S14","00:00:31","00:01:06","00:02:23","00:05:09.740","00:10:28.870","00:20:16.460","00:00:34.200","00:01:19.710","00:03:00.930","00:00:37.670","00:01:20.020","00:02:47.860","00:00:39.230","00:01:24.140","00:03:00.490",null,null,"00:02:44.260","00:05:43.050","S14"]
["S16",null,null,null,null,null,null,null,null,null,null,null,null,null,null,null,null,null,null,null,"S16"]
["S18",null,null,null,null,null,null,null,null,null,null,null,null,null,null,null,null,null,null,null,"S18"]
["S20",null,null,null,null,null,null,null,null,null,null,null,null,null,null,null,null,null,null,null,"S20"]
[]
{"$rows_left_out":20}
{"sheet":"Verðlaun","index":6,"n_rows":147,"n_cols":10,"rows_kept":147,"cut":false,"hidden":false,"merged":[]}
["1. Grein: Drengir 50m Baksund"]
[]
[null,"Róbert Í Jónsson",14,"Íþróttafélagið Fjörður        ","S14","00:00:36.540","00:00:27.428","00:00:33.060",571.04975275844936,""]
[null,"Már Gunnarsson",16,"NES                           ","S12","00:00:37","00:00:27.470","00:00:36.780",416.60506842433557,""]
[null,"Björn  Axel Agnarsson",13,"ÍFR                           ","S20","00:00:39.020","00:00:24.040","00:00:34.160",348.53773449372221,""]
[null,"Fannar Logi Jóhannesson",15,"Sundfélagið Óðinn             ","S","00:00:46.550",{"$error":"#N/A"},"00:00:44.170",239]
[null,"Ingólfur M Bjarnason",15,"NES                           ","S10","00:00:46","00:00:27.567","00:00:58.450",104.90787131682642,""]
[null,"Snævar Örn Kristmannsson",9,"ÍFR                           ","S14","00:01:11.080","00:00:27.428","00:01:00.080",95.1464794776237,""]
[null,"Baldur M Kristinsson",10,"Íþróttafélagið Fjörður        ","S14","00:01:21.600","00:00:27.428","00:01:01.890",87.040433926308111,""]
[null,"Hjalti G Guðmundsson",0,"Íþróttafélagið Ösp            ","S14","NT","00:00:27.428","00:01:06.760",69.347931498846634,""]
[null,"Leó Baldurrson",10,"NES                           ","S14","00:00:00","00:00:27.428","00:01:20.820",39.086425654984069,""]
[null,"Jóhann Stígur Eiríksson",15,"Íþróttafélagið Ösp            ","S14","00:01:29.560","00:00:27.428","00:01:22.040",37.368489258811962,""]
[null,"Þorleifur Pálmi Páls",12,"Íþróttafélagið Ösp            ","S14","00:01:24.660","00:00:27.428","00:01:37.990",21.929928844779305,""]
[null,"Róbert Salvar Reynisson",16,"NES                           ","S9","00:00:52","00:00:28.877"]
[null,"Logi Ingólfsson",9,"Sundfélagið Óðinn             ","S","00:00:00",{"$error":"#N/A"},"DQ"]
[null,"Unnar I Ingason",14,"Íþróttafélagið Fjörður        ","S14","00:01:03.390","00:00:27.428","DQ"]
[null,"Alexander Guðmundsson",12,"NES                           ","S14","00:00:48","00:00:27.428","DQ"]
[null,"Hallgrímur A Heimisson",14,"Íþróttafélagið Fjörður        ","S14","00:01:00.910","00:00:27.428"]
[]
[]
{"$rows_left_out":127}